Cobalt monochloride

Gas phase thermochemistry data

Quantity Value Units Method Reference Comment
Δfgas192.88kJ/molReviewChase, 1998Data last reviewed in December, 1973
Quantity Value Units Method Reference Comment
gas,1 bar245.68J/mol*KReviewChase, 1998Data last reviewed in December, 1973

Gas Phase Heat Capacity (Shomate Equation)

Cp° = A + B*t + C*t2 + D*t3 + E/t2
H° − H°298.15= A*t + B*t2/2 + C*t3/3 + D*t4/4 − E/t + F − H
S° = A*ln(t) + B*t + C*t2/2 + D*t3/3 − E/(2*t2) + G
    Cp = heat capacity (J/mol*K)
    H° = standard enthalpy (kJ/mol)
    S° = standard entropy (J/mol*K)
    t = temperature (K) / 1000.

View plot Requires a JavaScript / HTML 5 canvas capable browser.

View table.

Temperature (K) 298. - 1600.1600. - 6000.
A 36.3774168.07159
B 2.523090-22.38879
C -1.8088745.713588
D 0.502804-0.382975
E -0.164252-19.65681
F 181.3881141.5539
G 288.1002300.8313
H 192.8824192.8824
ReferenceChase, 1998Chase, 1998
Comment Data last reviewed in December, 1973 Data last reviewed in December, 1973

Gas phase ion energetics data

Data compiled by: Henry M. Rosenstock, Keith Draxl, Bruce W. Steiner, and John T. Herron

Ionization energy determinations

IE (eV) Method Reference
8.9 ± 0.5DERHastie and Margrave, 1968

References

Chase, 1998
Chase, M.W., Jr., NIST-JANAF Themochemical Tables, Fourth Edition, J. Phys. Chem. Ref. Data, Monograph 9, 1998, 1-1951. [all data]

Hastie and Margrave, 1968
Hastie, J.W.; Margrave, J.L., Ionization potentials and molecule-ion dissociation energies for diatomic metal halides, Fluorine Chem. Rev., 1968, 2, 77. [all data]