Palladium, di-1-propynylbis(triethylphosphine)-

Gas phase ion energetics data

Data compiled by: Sharon G. Lias, John E. Bartmess, Joel F. Liebman, John L. Holmes, Rhoda D. Levin, and W. Gary Mallard

Ionization energy determinations

IE (eV) Method Reference Comment
7.0PELouwen, Hengelmolen, et al., 1984
7.43PELouwen, Hengelmolen, et al., 1984Vertical value

References

Louwen, Hengelmolen, et al., 1984
Louwen, J.N.; Hengelmolen, R.; Grove, D.M.; Oskam, A.; DeKock, R.L., Ultraviolet photoelectron spectra of square-planar complexes of nickel triad metals. Spectra of trans-[(PEt3)2MXY] (M = Pd, Pt. X = Y = C≡CH, C≡CCH3, C≡N. X = Cl, Y = C≡N) and Hartree-Fock-Slater Calculations on model compounds, Organometallics, 1984, 3, 908. [all data]