Tricyclo[4.2.0.0<sup>2,5</sup>]octane,1,2,5,6-tetramethyl-3,4,7,8-tetrakis(methylene)-(1&#945;,2&#946;,5&#946;,6&#945;)-

Gas phase ion energetics data

Data compiled by: Sharon G. Lias, Rhoda D. Levin, and Sherif A. Kafafi

Ionization energy determinations

IE (eV) Method Reference Comment
8.10 ± 0.02PEBorden, Young, et al., 1979Vertical value

References

Borden, Young, et al., 1979
Borden, W.T.; Young, S.D.; Frost, D.C.; Westwood, N.P.C.; Jorgensen, W.L., Photoelectron spectra of the 1,2,5,6-tetramethyl-3,4,7,8-tetramethylene derivatives of tricyclo[3.3.0.02,6]octane and tricyclo[4.2.0.02,5]octane, J. Org. Chem., 1979, 44, 737. [all data]