N-Methyl-N-propyl-propylamine

Phase change data

Data compiled by: Thermodynamics Research Center, NIST Boulder Laboratories, Chris Muzny director

Quantity Value Units Method Reference Comment
Tboil386.65KN/AVon Braun, 1900Uncertainty assigned by TRC = 3. K
Tboil390.15KN/APasson, 1891Uncertainty assigned by TRC = 3. K

In addition to the Thermodynamics Research Center (TRC) data available from this site, much more physical and chemical property data is available from the following TRC products:

References

Von Braun, 1900
Von Braun, J., Chem. Ber., 1900, 33, 1447. [all data]

Passon, 1891
Passon, M., Chem. Ber., 1891, 24, 1678. [all data]