Ni(SALEN-H2) radical

Gas phase ion energetics data

Data compiled by: John E. Bartmess

Electron affinity determinations

EA (eV) Method Reference Comment
1.37 ± 0.10IMREChen, Pan, et al., 1991SALEN-H2: bis(salicylaldehyde[O-])oxime of diaminoethene.

References

Chen, Pan, et al., 1991
Chen, H.L.; Pan, Y.H.; Groh, S.; Hagan, T.E.; Ridge, D.P., Gas-Phase Charge-Transfer Reactions and Electron Affinities of Macrocyclic, Anionic Nickel Complexes - Ni(SALEN), Ni(Tetraphenylporphyrin), and Derivatives., J. Am. Chem. Soc., 1991, 113, 7, 2766, https://doi.org/10.1021/ja00007a068 . [all data]