1,2-Benzenedicarboxylic acid, ethyl methyl ester

Normal alkane RI, polar column, temperature ramp

Data compiled by: NIST Mass Spectrometry Data Center, William E. Wallace, director

Column type Capillary
Active phase DB-Wax
Column length (m) 60.
Carrier gas He
Substrate
Column diameter (mm) 0.25
Phase thickness (μm) 0.5
Tstart (C) 50.
Tend (C) 230.
Heat rate (K/min) 3.
Initial hold (min) 2.
Final hold (min) 20.
I 2315.
ReferenceCai, Lin, et al., 2006
Comment MSDC-RI

References

Cai, Lin, et al., 2006
Cai, J.; Lin, P.; Zhu, X.; Su, Q., Comparative analysis of clary sage (S. sclarea L.) oil volatiles by GC-FTIR and GC-MS, Food Chem., 2006, 99, 2, 401-407, https://doi.org/10.1016/j.foodchem.2005.07.041 . [all data]