Cyclopentylcarboxylic acid

Phase change data

Data compiled by: Robert L. Brown and Stephen E. Stein

Quantity Value Units Method Reference Comment
Tboil489.2KN/AAldrich Chemical Company Inc., 1990

Reduced pressure boiling point

Tboil (K) Pressure (bar) Reference
377.20.015Weast and Grasselli, 1989
389. - 390.0.028Frinton Laboratories Inc., 1986

Reaction thermochemistry data

Data compiled by: John E. Bartmess

Individual Reactions

C6H9O2- + Hydrogen cation = Cyclopentylcarboxylic acid

By formula: C6H9O2- + H+ = C6H10O2

Quantity Value Units Method Reference Comment
Δr1446. ± 9.2kJ/molG+TSCaldwell, Renneboog, et al., 1989gas phase
Quantity Value Units Method Reference Comment
Δr1417. ± 8.4kJ/molIMRECaldwell, Renneboog, et al., 1989gas phase

References

Aldrich Chemical Company Inc., 1990
Aldrich Chemical Company Inc., Catalog Handbook of Fine Chemicals, Aldrich Chemical Company, Inc., Milwaukee WI, 1990, 1. [all data]

Weast and Grasselli, 1989
CRC Handbook of Data on Organic Compounds, 2nd Editon, Weast,R.C and Grasselli, J.G., ed(s)., CRC Press, Inc., Boca Raton, FL, 1989, 1. [all data]

Frinton Laboratories Inc., 1986
Frinton Laboratories Inc., Catalog Number 11, Frinton Laboratories Inc., Vineland, NJ, 1986, 99. [all data]

Caldwell, Renneboog, et al., 1989
Caldwell, G.; Renneboog, R.; Kebarle, P., Gas Phase Acidities of Aliphatic Carboxylic Acids, Based on Measurements of Proton Transfer Equilibria, Can. J. Chem., 1989, 67, 4, 661, https://doi.org/10.1139/v89-092 . [all data]