2-Methyl-2-nitropropyl-4,4,4-trinitrobutyrate

Phase change data

Data compiled as indicated in comments:
TRC - Thermodynamics Research Center, NIST Boulder Laboratories, Chris Muzny director
AC - William E. Acree, Jr., James S. Chickos

Quantity Value Units Method Reference Comment
Tfus349.4KN/ARosen, Holden, et al., 1971Crystal phase 1 phase; Uncertainty assigned by TRC = 0.1 K; TRC

Enthalpy of fusion

ΔfusH (kJ/mol) Temperature (K) Method Reference Comment
5.27349.4DSCRosen, Holden, et al., 1971AC

In addition to the Thermodynamics Research Center (TRC) data available from this site, much more physical and chemical property data is available from the following TRC products:

References

Rosen, Holden, et al., 1971
Rosen, J.M.; Holden, J.R.; Simmons, H.T., Sr., Microscope, 1971, 19, 2, 151. [all data]