Dichloroamine

Gas phase ion energetics data

Data compiled as indicated in comments:
LLK - Sharon G. Lias, Rhoda D. Levin, and Sherif A. Kafafi

Ionization energy determinations

IE (eV) Method Reference Comment
9.98 ± 0.05PEColbourne, Frost, et al., 1978LLK
10.52PELivett, Nagy-Felsobuki, et al., 1978Vertical value; LLK

References

Colbourne, Frost, et al., 1978
Colbourne, D.; Frost, D.C.; McDowell, C.A.; Westwood, N.P.C., The photoelectron spectra of the chloramines NH2Cl, NHCl2, NCl3 and the methyl chloramines CH3NHCl, CH3NCl2, and (CH3)2NCl, J. Chem. Phys., 1978, 69, 1078. [all data]

Livett, Nagy-Felsobuki, et al., 1978
Livett, M.K.; Nagy-Felsobuki, E.; Peel, J.B.; Willett, G.D., Photoelectron spectra of chloramine and dichloramine, Inorg. Chem., 1978, 17, 1608. [all data]