2-Methylbenzo[b]thiophene 1-oxide

Gas phase ion energetics data

Data compiled as indicated in comments:
LBLHLM - Sharon G. Lias, John E. Bartmess, Joel F. Liebman, John L. Holmes, Rhoda D. Levin, and W. Gary Mallard

Ionization energy determinations

IE (eV) Method Reference Comment
8.75PEBened, Durand, et al., 1982Vertical value; LBLHLM

References

Bened, Durand, et al., 1982
Bened, A.; Durand, R.; Pioch, D.; Geneste, P.; Declercq, J.-P.; Germain, G.; Rambaud, J.; Roques, R.; Guimon, C.; Pfister-Guillouzo, G., Isoxazolines by cycloadditions of mesitonitrile oxide with benzo[b]thiophene S-oxide and S,S-dioxide. Structural studies, theoretical explanations, and kinetics, J. Org. Chem., 1982, 47, 2461. [all data]