5-Methoxy-1-tetralone

Phase change data

Data compiled as indicated in comments:
BS - Robert L. Brown and Stephen E. Stein
AC - William E. Acree, Jr., James S. Chickos

Quantity Value Units Method Reference Comment
Δsub97.9 ± 0.4kJ/molCMatos, Sousa, et al., 2009AC

Reduced pressure boiling point

Tboil (K) Pressure (bar) Reference Comment
434.20.009Weast and Grasselli, 1989BS

Enthalpy of fusion

ΔfusH (kJ/mol) Temperature (K) Method Reference Comment
22.2362.5DSCMatos, Sousa, et al., 2009AC

References

Matos, Sousa, et al., 2009
Matos, M. Agostinha R.; Sousa, Clara C.S.; Morais, Victor M.F., Thermochemical study of some methoxytetralones, The Journal of Chemical Thermodynamics, 2009, 41, 1, 69-73, https://doi.org/10.1016/j.jct.2008.07.021 . [all data]

Weast and Grasselli, 1989
CRC Handbook of Data on Organic Compounds, 2nd Editon, Weast,R.C and Grasselli, J.G., ed(s)., CRC Press, Inc., Boca Raton, FL, 1989, 1. [all data]