Selenolo[2,3-c]thiophene

Gas phase ion energetics data

Data compiled by: Sharon G. Lias, John E. Bartmess, Joel F. Liebman, John L. Holmes, Rhoda D. Levin, and W. Gary Mallard

Ionization energy determinations

IE (eV) Method Reference Comment
7.76PEGleiter, Eckert-Maksie, et al., 1987
7.76PEGleiter, Eckert-Maksie, et al., 1987Vertical value

References

Gleiter, Eckert-Maksie, et al., 1987
Gleiter, R.; Eckert-Maksie, M.; Konar, A., The PE spectra of the seleno analogues of thieno[3,4-b]thiophene, Chem. Ber., 1987, 120, 1917. [all data]