Bicyclo[3.1.0]hexane, 4-methylene-1-(1-methylethyl)-

Normal alkane RI, polar column, temperature ramp

Data compiled by: NIST Mass Spectrometry Data Center, William E. Wallace, director

Column type CapillaryCapillaryCapillaryCapillaryCapillary
Active phase RTX-WaxHP-InnowaxHP-InnowaxRTX-WaxBP-20
Column length (m) 60.60.30.60.
Carrier gas HeliumHeliumHeliumHeliumNitrogen
Substrate
Column diameter (mm) 0.220.250.250.22
Phase thickness (μm) 0.250.250.250.25
Tstart (C) 60.60.50.60.60.
Tend (C) 230.220.250.230.200.
Heat rate (K/min) 2.5.5.2.5.
Initial hold (min)  1.5.
Final hold (min) 5.5.10.30.
I 1111.1130.1138.1107.1130.
ReferenceBendiabdellah, El Amine Dib, et al., 2012Feng, Cui, et al., 2011Menichini, Tundis, et al., 2011Dib, Djabou, et al., 2010Mishra, Chaudhary, et al., 2010
Comment MSDC-RI MSDC-RI MSDC-RI MSDC-RI MSDC-RI
Column type CapillaryCapillaryCapillaryCapillaryCapillary
Active phase Supelcowax-10Supelcowax-10DB-WaxRTX-WaxInnowax
Column length (m) 30.30.30.60.30.
Carrier gas HeliumHeliumHydrogenHeliumHelium
Substrate
Column diameter (mm) 0.200.250.250.220.25
Phase thickness (μm) 0.200.250.250.250.25
Tstart (C) 70.70.30.60.40.
Tend (C) 220.220.230.230.250.
Heat rate (K/min) 3.2.8.2.6.
Initial hold (min)   5. 1.
Final hold (min) 15. 10.30.4.
I 1124.1123.1115.1106.1128.
ReferenceNeves, Rosa, et al., 2010Benites, Moiteiro, et al., 2009Karlsson, Birgersson, et al., 2009Museli, Pau, et al., 2009Seo, Kim, et al., 2009
Comment MSDC-RI MSDC-RI MSDC-RI MSDC-RI MSDC-RI
Column type CapillaryCapillaryCapillaryCapillaryCapillary
Active phase DB-WaxHP-InnowaxHP InnowaxHP-InnowaxCP-Wax 52CB
Column length (m) 60.30.30.30.60.
Carrier gas HeliumNitrogenHeliumN2He
Substrate
Column diameter (mm) 0.250.250.320.250.25
Phase thickness (μm) 0.250.520.500.250.25
Tstart (C) 50.35.60.50.40.
Tend (C) 220.205.260.240.220.
Heat rate (K/min) 3.3.3.5.3.
Initial hold (min) 2.10. 1.
Final hold (min) 70.10. 4.
I 1124.1132.1123.1125.1137.
ReferenceShimizu, Imayoshi, et al., 2009Wannes, Mhamdi, et al., 2009Capetanos, Saroglou, et al., 2007Cheraif, Ben Jannet, et al., 2007Chyau, Tsai, et al., 2007
Comment MSDC-RI MSDC-RI MSDC-RI MSDC-RI MSDC-RI
Column type CapillaryCapillaryCapillaryCapillaryCapillary
Active phase HP-InnowaxPEG-20MHP-InnowaxCP-Wax 52CBTC-FFAP
Column length (m) 30.60.30.30.
Carrier gas HeliumHeHeHeHe
Substrate
Column diameter (mm) 0.250.250.250.320.25
Phase thickness (μm) 0.250.250.250.250.25
Tstart (C) 40.90.60.40.60.
Tend (C) 250.225.240.220.220.
Heat rate (K/min) 2.3.2.3.3.
Initial hold (min) 5.  1.
Final hold (min)  15.20.2.30.
I 1132.1136.1124.1125.1133.
ReferenceFormisano, Rigano, et al., 2007Gil A., Van Baren C.M., et al., 2007Hachicha, Skanji, et al., 2007Hymete, Rohloff, et al., 2007Kurose, Okamura, et al., 2007
Comment MSDC-RI MSDC-RI MSDC-RI MSDC-RI MSDC-RI
Column type CapillaryCapillaryCapillaryCapillaryCapillary
Active phase Carbowax 20MDB-WaxSupelcowax-10CP-Wax 52CBSupelcowax-10
Column length (m) 30.60.30.60.30.
Carrier gas HeHeHeHeHe
Substrate
Column diameter (mm) 0.250.320.20.320.25
Phase thickness (μm) 0.250.250.20.50.25
Tstart (C) 60.70.70.40.50.
Tend (C) 230.220.220.220.250.
Heat rate (K/min) 3.4.3.4.2.
Initial hold (min)    8.
Final hold (min)   15.20.
I 1104.1113.1127.1124.1120.
ReferenceLimberger, Scopel, et al., 2007Pala-Paul, Brophy, et al., 2007Pinto, Salgueiro, et al., 2007Povolo, Contarini, et al., 2007Raal, Orav, et al., 2007
Comment MSDC-RI MSDC-RI MSDC-RI MSDC-RI MSDC-RI
Column type CapillaryCapillaryCapillaryCapillaryCapillary
Active phase CarbowaxSupelcowax-10Supelcowax-10Supelcowax-10DB-Wax
Column length (m) 60.30.30.30.60.
Carrier gas He  HeHe
Substrate
Column diameter (mm) 0.250.250.250.250.25
Phase thickness (μm) 0.250.250.250.250.25
Tstart (C) 40.40.40.40.60.
Tend (C) 180.210.250.250.180.
Heat rate (K/min) 5.2.2.3.3.
Initial hold (min)    5.8.
Final hold (min)  33.33.10.80.
I 1135.1126.1127.1117.1107.
ReferenceSingh, Kumar, et al., 2007Sylvestre, Longtin, et al., 2007Sylvestre, Pichette, et al., 2007Vichi, Riu-Aumatell, et al., 2007Wei A. and Shibamoto T., 2007
Comment MSDC-RI MSDC-RI MSDC-RI MSDC-RI MSDC-RI
Column type CapillaryCapillaryCapillaryCapillaryCapillary
Active phase InnowaxInnowaxAT-WaxSupelcowax 10DB-Wax
Column length (m) 30.30.60.30.60.
Carrier gas N2N2HeHeliumN2
Substrate
Column diameter (mm) 0.250.250.250.200.25
Phase thickness (μm) 0.250.250.250.200.25
Tstart (C) 50.50.60.70.70.
Tend (C) 280.280.200.220.230.
Heat rate (K/min) 9.9.4.3.2.
Initial hold (min) 3.3.  2.
Final hold (min) 3.3.20.15.20.
I 1125.1132.1132.1128.1132.
ReferenceAbdelwahed, Hayder, et al., 2006Abdelwahed, Hayder, et al., 2006Borges, Rojas, et al., 2006Cavaleiro, Pinto, et al., 2006Choi, 2006
Comment MSDC-RI MSDC-RI MSDC-RI MSDC-RI MSDC-RI
Column type CapillaryCapillaryCapillaryCapillaryCapillary
Active phase BP-20HP-20MCP-Wax 52CBFFAPDB-Wax
Column length (m) 50.50.30.20.60.
Carrier gas HeHeHeHe
Substrate
Column diameter (mm) 0.220.20.320.250.25
Phase thickness (μm) 0.250.10.250.250.25
Tstart (C) 60.60.60.90.70.
Tend (C) 220.220.220.250.230.
Heat rate (K/min) 2.2.3.36.2.
Initial hold (min)   7. 2.
Final hold (min) 20.30.3. 20.
I 1120.1099.1124.1145.1128.
ReferenceFanciullino, Tomi, et al., 2006Filippi, Lanfranchi, et al., 2006Hymete, Rohloff, et al., 2006Kitchlu, Bakshi, et al., 2006Lan Phi N.T., Nishiyama C., et al., 2006
Comment MSDC-RI MSDC-RI MSDC-RI MSDC-RI MSDC-RI
Column type CapillaryCapillaryCapillaryCapillaryCapillary
Active phase SupelcowaxNB-20MDB-WaxSupelcowax-10Carbowax 20M
Column length (m) 30.30.60.30.60.
Carrier gas N2He HeN2
Substrate
Column diameter (mm) 0.320.20.250.250.25
Phase thickness (μm) 0.250.250.250.250.25
Tstart (C) 50.50.70.50.40.
Tend (C) 200.250.230.220.190.
Heat rate (K/min) 5.2.2.4.10.
Initial hold (min)   2.1.2.
Final hold (min)   20.10.15.
I 1130.1118.1130.1121.1130.
ReferenceMartin, Joseph, et al., 2006Orav, Raal, et al., 2006Sawamura, Onishi, et al., 2006Wong, Lim, et al., 2006Babu and Kaul, 2005
Comment MSDC-RI MSDC-RI MSDC-RI MSDC-RI MSDC-RI
Column type CapillaryCapillaryCapillaryCapillaryCapillary
Active phase InnowaxHP-InnowaxStabilwaxStabilwaxTC-FFAP
Column length (m) 50.30.30.30.60.
Carrier gas HeHeH2 He
Substrate
Column diameter (mm) 0.20.250.320.320.25
Phase thickness (μm) 0.50.170.50.50.4
Tstart (C) 60.60.40.40.60.
Tend (C) 250.210.280.280.220.
Heat rate (K/min) 2.4.6.6.3.
Initial hold (min)  3.5.5.
Final hold (min) 60.15.5.5.30.
I 1120.1135.1106.1108.1133.
ReferenceBendimerad and Bendiab, 2005Ferretti, Maggi, et al., 2005Jirovetz, Buchbauer, et al., 2005Jirovetz, Buchbauer, et al., 2005, 2Kurose and Yatagai, 2005
Comment MSDC-RI MSDC-RI MSDC-RI MSDC-RI MSDC-RI
Column type CapillaryCapillaryCapillaryCapillaryCapillary
Active phase DB-WaxDB-WaxDB-WaxCP-Wax 52CBDB-Wax
Column length (m) 60.60.60.30.30.
Carrier gas N2N2HeHeHe
Substrate
Column diameter (mm) 0.250.250.320.320.25
Phase thickness (μm) 0.250.250.250.250.25
Tstart (C) 70.70.35.40.40.
Tend (C) 230.230.220.220.250.
Heat rate (K/min) 2.2.3.4.4.
Initial hold (min) 2.2. 1.
Final hold (min) 20.20.  10.
I 1131.1131.1113.1124.1098.
ReferenceNjoroge, Koaze, et al., 2005Njoroge, Koaze, et al., 2005, 2Palá-Paúl, Pérez-Alonso, et al., 2005Rohloff and Bones, 2005Salehi, Sonboli, et al., 2005
Comment MSDC-RI MSDC-RI MSDC-RI MSDC-RI MSDC-RI
Column type CapillaryCapillaryCapillaryCapillaryCapillary
Active phase Supelcowax-10Supelcowax-10Supelcowax-10ZB-WaxZB-Wax
Column length (m) 30.30.30.30.30.
Carrier gas   HeHeliumHe
Substrate
Column diameter (mm) 0.250.250.250.320.32
Phase thickness (μm) 0.250.250.250.250.25
Tstart (C) 40.40.50.40.40.
Tend (C) 210.220.220.250.250.
Heat rate (K/min) 2.3.4.5.5.
Initial hold (min) 2.5.3.2.2.
Final hold (min) 33.10.30.5.10.
I 1110.1117.1117.1097.1097.
ReferenceStevanovic, Garneau, et al., 2005Vichi, Riu-Aumatell, et al., 2005Wong, Lee, et al., 2005N/AWu, Krings, et al., 2005
Comment MSDC-RI MSDC-RI MSDC-RI MSDC-RI MSDC-RI
Column type CapillaryCapillaryCapillaryCapillaryCapillary
Active phase DB-WaxDB-WaxDB-WaxSupelcowax-10Supelcowax-10
Column length (m) 30.60.60.60.30.
Carrier gas HeN2N2HeN2
Substrate
Column diameter (mm) 0.250.250.250.20.25
Phase thickness (μm) 0.250.250.250.20.25
Tstart (C) 90.70.70.60.40.
Tend (C) 220.230.230.200.230.
Heat rate (K/min) 7.2.2.4.2.
Initial hold (min) 2.2.2.
Final hold (min) 5.20.20.40.
I 1146.1134.1133.1096.1128.
ReferenceAgnihotri, Thappa, et al., 2004Choi, 2004Choi, 2004, 2Gauvin, Ravaomanarivo, et al., 2004González, Guerra, et al., 2004
Comment MSDC-RI MSDC-RI MSDC-RI MSDC-RI MSDC-RI
Column type CapillaryCapillaryCapillaryCapillaryCapillary
Active phase DB-WaxSupelcowax-10Innowax FSCSupelcowax-10Supelcowax-10
Column length (m) 60.30.60.50.50.
Carrier gas He HeliumHeHe
Substrate
Column diameter (mm) 0.250.250.250.20.2
Phase thickness (μm)  0.25 0.250.25
Tstart (C) 60.40.60.70.70.
Tend (C) 220.210.220.230.230.
Heat rate (K/min) 2.2.4.2.2.
Initial hold (min) 4.2.10.
Final hold (min)  33.
I 1122.1128.1132.1123.1125.
ReferenceJiang and Kubota, 2004Lopez Arze, Collin, et al., 2004Lourens, Reddy, et al., 2004Orav, Stulova, et al., 2004Orav, Stulova, et al., 2004
Comment MSDC-RI MSDC-RI MSDC-RI MSDC-RI MSDC-RI
Column type CapillaryCapillaryCapillaryCapillaryCapillary
Active phase InnowaxNB-20MSW-10DB-WaxDB-Wax
Column length (m) 50.50.50.60.60.
Carrier gas HeHeHe Nitrogen
Substrate
Column diameter (mm) 0.20.20.200.250.25
Phase thickness (μm) 0.20.250.250.250.25
Tstart (C) 70.50.50.70.70.
Tend (C) 220.250.230.230.230.
Heat rate (K/min) 4.2.2.2.2.
Initial hold (min)    2.2.
Final hold (min)    20.
I 1140.1118.1123.1139.1139.
ReferencePalá-Paúl, García-Jiménez, et al., 2004Raal, Arak, et al., 2004Raal, Paaver, et al., 2004Sawamura, Son, et al., 2004Sawamura, Sou, et al., 2004
Comment MSDC-RI MSDC-RI MSDC-RI MSDC-RI MSDC-RI
Column type CapillaryCapillaryCapillaryCapillaryCapillary
Active phase HP-WaxSupelcowax-10HP-20MHP-20MDB-Wax
Column length (m) 30.30.50.50.60.
Carrier gas N2HeHeHeHelium
Substrate
Column diameter (mm) 0.250.250.20.20.25
Phase thickness (μm) 0.250.250.20.2
Tstart (C) 60.60.70.70.70.
Tend (C) 220.240.180.180.210.
Heat rate (K/min) 5.4.4.4.2.
Initial hold (min) 10. 4.4.
Final hold (min)   10.10.60.
I 1130.1128.1117.1117.1132.
ReferenceBertoli, Menichini, et al., 2003Cabanillas, Lopez, et al., 2003Juteau, Jerkovic, et al., 2003Mastelic and Jerkovic, 2003Mookdasanit, Tamura, et al., 2003
Comment MSDC-RI MSDC-RI MSDC-RI MSDC-RI MSDC-RI
Column type CapillaryCapillaryCapillaryCapillaryCapillary
Active phase Supelcowax-10SW-10HP-InnowaxInnowaxDB-Wax
Column length (m) 50.50.50.60.60.
Carrier gas HeHe HeN2
Substrate
Column diameter (mm) 0.20.200.20.250.25
Phase thickness (μm) 0.250.250.2 0.25
Tstart (C) 70.50.50.60.70.
Tend (C) 230.250.220.220.230.
Heat rate (K/min) 2.2.4.4.2.
Initial hold (min)   5.10.2.
Final hold (min)    10.20.
I 1125.1125.1129.1132.1115.
ReferenceOrav, Kailas, et al., 2003Raal, Arak, et al., 2003Stashenko, Jaramillo, et al., 2003Suleimenov, Atazharova, et al., 2003Tu, Onishi, et al., 2003
Comment MSDC-RI MSDC-RI MSDC-RI MSDC-RI MSDC-RI
Column type CapillaryCapillaryCapillaryCapillaryCapillary
Active phase DB-WaxHP-InnowaxDB-WaxCarbowax 20MSupelcowax-10
Column length (m) 60.50.60.30.60.
Carrier gas N2HeH2HeHe
Substrate
Column diameter (mm) 0.250.20.320.250.2
Phase thickness (μm) 0.250.20.250.3250.5
Tstart (C) 70.70.40.50.70.
Tend (C) 230.190.245.215.220.
Heat rate (K/min) 2.5.1.54.2.
Initial hold (min) 2.
Final hold (min) 20. 20.20.
I 1120.1135.1113.1130.1125.
ReferenceTu, Onishi, et al., 2003, 2Velasco-Negueruela, Pérez-Alonso, et al., 2003Gancel, Ollé, et al., 2002Kasali, Winterhalter, et al., 2002Orav, Kailas, et al., 2002
Comment MSDC-RI MSDC-RI MSDC-RI MSDC-RI MSDC-RI
Column type CapillaryCapillaryCapillaryCapillaryCapillary
Active phase HP-WaxDB-WaxDB-WaxDB-WaxSupelcowax
Column length (m) 50.60.60.60.30.
Carrier gas N2N2N2HeHe
Substrate
Column diameter (mm) 0.250.250.250.250.25
Phase thickness (μm) 0.250.250.250.250.25
Tstart (C) 75.70.70.40.40.
Tend (C) 220.230.230.200.240.
Heat rate (K/min) 3.2.2.2.2.
Initial hold (min) 4.2. 2.
Final hold (min)  20.
I 1118.1123.1134.1108.1101.
ReferencePriestap, van Baren, et al., 2002Tu, Onishi, et al., 2002Tu, Thanh, et al., 2002Umano, Hagi, et al., 2002Chiasson, Bélanger, et al., 2001
Comment MSDC-RI MSDC-RI MSDC-RI MSDC-RI MSDC-RI
Column type CapillaryCapillaryCapillaryCapillaryCapillary
Active phase DB-WaxDB-WaxBP-20TC-WaxPEG-20M
Column length (m) 60.60.50.60.50.
Carrier gas HeHeHeHeHe
Substrate
Column diameter (mm) 0.250.250.220.250.2
Phase thickness (μm) 0.25 0.25
Tstart (C) 45.40.60.80.70.
Tend (C) 240.220.230.250.250.
Heat rate (K/min) 3.2.2.4.2.
Initial hold (min)
Final hold (min)   35.47.
I 1121.1138.1119.1114.1124.
ReferenceChristoph, 2001Jiang and Kubota, 2001Lota, de Rocca Serra, et al., 2001Miyazawa, Kurose, et al., 2001Orav, Kailas, et al., 2001
Comment MSDC-RI MSDC-RI MSDC-RI MSDC-RI MSDC-RI
Column type CapillaryCapillaryCapillaryCapillaryCapillary
Active phase PEG-20MPEG-20MCarbowax 20MInnowaxDB-Wax
Column length (m) 50.50.50.60.60.
Carrier gas HeHeHeHe
Substrate
Column diameter (mm) 0.20.20.220.250.25
Phase thickness (μm)   0.250.250.25
Tstart (C) 70.70.60.60.30.
Tend (C) 220.220.220.220.170.
Heat rate (K/min) 2.2.2.4.2.
Initial hold (min)    10.4.
Final hold (min)    10.30.
I 1125.1125.1130.1132.1117.
ReferenceOrav and Kann, 2001Orav and Kann, 2001Vernin, Lageot, et al., 2001Baser, Özek, et al., 2000Buttery, Light, et al., 2000
Comment MSDC-RI MSDC-RI MSDC-RI MSDC-RI MSDC-RI
Column type CapillaryCapillaryCapillaryCapillaryCapillary
Active phase CP-Wax 52CBDB-WaxBP-20HP-20MDB-Wax
Column length (m) 50.30.25.50.60.
Carrier gas HeHeNitrogenHeNitrogen
Substrate
Column diameter (mm) 0.300.20.500.200.25
Phase thickness (μm) 0.25 0.250.20
Tstart (C) 40.50.60.70.40.
Tend (C) 220.180.200.180.200.
Heat rate (K/min) 3.3.5.4.2.
Initial hold (min) 5.8. 4.10.
Final hold (min)
I 1130.1118.1115.1112.1135.
ReferenceChagonda, Makanda, et al., 2000Franco and Shibamoto, 2000Mallavarapu, Rao, et al., 2000Mastelic, Milos, et al., 2000Tamura, Boonbumrung, et al., 2000
Comment MSDC-RI MSDC-RI MSDC-RI MSDC-RI MSDC-RI
Column type CapillaryCapillaryCapillaryCapillaryCapillary
Active phase DB-WaxCW 20MSupelcowax-10BP-20Innowax
Column length (m) 60.25.30.25.60.
Carrier gas HeHydrogen  He
Substrate
Column diameter (mm) 0.250.320.250.330.25
Phase thickness (μm) 0.250.250.250.50.25
Tstart (C) 40.50.60.80.60.
Tend (C) 200.220.220.220.220.
Heat rate (K/min) 2.3.4.5.
Initial hold (min) 2.1.  10.
Final hold (min)  10.
I 1119.1116.1124.1149.1132.
ReferenceUmano, Hagi, et al., 2000Bicchi, Binello, et al., 1999Choo, Wong, et al., 1999Dunlop, Bignell, et al., 1999Kaya, Baser, et al., 1999
Comment MSDC-RI MSDC-RI MSDC-RI MSDC-RI MSDC-RI
Column type CapillaryCapillaryCapillaryCapillaryCapillary
Active phase HP-InnowaxHP-InnowaxSupelcowax-10CarbowaxDB-Wax
Column length (m) 60.60.30.50.60.
Carrier gas HeHeHeN2He
Substrate
Column diameter (mm) 0.250.250.250.20.25
Phase thickness (μm) 0.250.25  0.25
Tstart (C) 60.60.60.80.60.
Tend (C) 220.220.240.200.240.
Heat rate (K/min)   4.1.4.
Initial hold (min) 10.10.
Final hold (min)    20.
I 1132.1132.1124.1128.1123.
ReferenceKaya, Baser, et al., 1999, 2Kaya, Baser, et al., 1999, 2Labuckas, Zygadlo, et al., 1999Menon, Chacko, et al., 1999Ngassoum, Yonkeu, et al., 1999
Comment MSDC-RI MSDC-RI MSDC-RI MSDC-RI MSDC-RI
Column type CapillaryCapillaryCapillaryCapillaryCapillary
Active phase NB-351HP-20MBP-20BP-20HP-20M
Column length (m) 25.25.25.25.50.
Carrier gas H2HeliumN2H2He
Substrate
Column diameter (mm) 0.30.200.50.330.2
Phase thickness (μm) 0.50.25 0.50.2
Tstart (C) 70.60.60.80.70.
Tend (C) 250.200.200.220.180.
Heat rate (K/min) 5.3.5.5.4.
Initial hold (min) 2.4.  4.
Final hold (min)     10.
I 1135.1130.1114.1149.1092.
ReferenceOnocha, Ekundayo, et al., 1999Prikhod'ko, Klyuev, et al., 1999Rao, Bhattacharya, et al., 1999Bignell, Dunlop, et al., 1998Milso, Mastelic, et al., 1998
Comment MSDC-RI MSDC-RI MSDC-RI MSDC-RI MSDC-RI
Column type CapillaryCapillaryCapillaryCapillaryCapillary
Active phase DB-WaxDB-WaxHP-InnowaxHP-Innowax FSCBP-20
Column length (m) 30.30.60.60.25.
Carrier gas N2N2HeHeH2
Substrate
Column diameter (mm) 0.250.250.250.250.33
Phase thickness (μm) 0.250.250.25 0.5
Tstart (C) 45.45.50.60.80.
Tend (C) 220.220.220.240.220.
Heat rate (K/min) 3.3.5.4.5.
Initial hold (min)   5.10.
Final hold (min)    10.
I 1112.1120.1156.1131.1149.
ReferenceMolleken U., Sinnwell V., et al., 1998Mölleken, Sinnwell, et al., 1998Stashenko, Cervantes, et al., 1998Baser, Kirimer, et al., 1997Bignell, Dunlop, et al., 1997
Comment MSDC-RI MSDC-RI MSDC-RI MSDC-RI MSDC-RI
Column type CapillaryCapillaryCapillaryCapillaryCapillary
Active phase BP-20BP-20BP-20BP-20BP-20
Column length (m) 25.25.25.25.25.
Carrier gas H2H2H2 H2
Substrate
Column diameter (mm) 0.330.330.330.330.33
Phase thickness (μm) 0.50.50.50.50.5
Tstart (C) 80.80.80.80.80.
Tend (C) 220.220.220.220.220.
Heat rate (K/min) 5.5.5.5.5.
Initial hold (min)
Final hold (min)
I 1149.1149.1149.1149.1149.
ReferenceBignell, Dunlop, et al., 1997, 2Bignell, Dunlop, et al., 1997, 3Bignell, Dunlop, et al., 1997, 4Bignell, Dunlop, et al., 1997, 5Bignell, Dunlop, et al., 1997, 6
Comment MSDC-RI MSDC-RI MSDC-RI MSDC-RI MSDC-RI
Column type CapillaryCapillaryCapillaryCapillaryCapillary
Active phase Supelcowax-10Supelcowax-10SP-1000PEG-20MDB-Wax
Column length (m) 30.0.85.50.60.
Carrier gas  HeHeHeHe
Substrate
Column diameter (mm) 0.250.250.500.250.32
Phase thickness (μm)     0.50
Tstart (C) 60.40.65.70.50.
Tend (C) 240.240.225.250.250.
Heat rate (K/min) 4.3.3.2.8.
Initial hold (min)     1.
Final hold (min)     6.
I 1128.1124.1120.1124.1128.
ReferenceZunino, Novillo-Newton, et al., 1997Zygadlo, Ariza-Espinar, et al., 1997Brophy, Goldsack, et al., 1996Orav, Kailas, et al., 1996Sagrero-Nieves and Bartley, 1996
Comment MSDC-RI MSDC-RI MSDC-RI MSDC-RI MSDC-RI
Column type CapillaryCapillaryCapillaryCapillaryCapillary
Active phase DB-WaxCarbowax 20MSupelcowax-10Supelcowax-10Carbowax 20M
Column length (m) 60.60.  45.
Carrier gas HeHe  Hydrogen
Substrate
Column diameter (mm) 0.250.25  0.32
Phase thickness (μm) 0.250.25  1.0
Tstart (C) 50.50.40.40.60.
Tend (C) 180.150.210.210.200.
Heat rate (K/min) 2.52.2.2.2.
Initial hold (min) 5.10.2.2.5.
Final hold (min)  20.120.120.
I 1126.1120.1124.1124.1131.
ReferenceStashenko, Puertas, et al., 1996Tirado, Stashenko, et al., 1995Collin, Deslauriers, et al., 1993Collin, Deslauriers, et al., 1993Kollmannsberger, Nitz, et al., 1992
Comment MSDC-RI MSDC-RI MSDC-RI MSDC-RI MSDC-RI
Column type CapillaryCapillaryCapillaryCapillaryCapillary
Active phase Supelcowax-10DB-WaxFFAPCarbowax 20MCarbowax 20M
Column length (m) 60.30.50.50.25.
Carrier gas He
Substrate
Column diameter (mm) 0.320.32 0.250.30
Phase thickness (μm)
Tstart (C) 60.70.50.80.40.
Tend (C) 220.200.180.200.220.
Heat rate (K/min) 2.4.10.2.2.
Initial hold (min) 1.2.1. 5.
Final hold (min)
I 1137.1134.1128.1118.1122.
ReferenceLoughrin, Hamilton-Kemp, et al., 1990Wyllie, Brophy, et al., 1990Brophy, Davies, et al., 1989Shibamoto, 1987Nykanen, 1986
Comment MSDC-RI MSDC-RI MSDC-RI MSDC-RI MSDC-RI
Column type CapillaryCapillaryCapillaryPacked
Active phase BP-20Carbowax 20MCarbowax 20MCarbowax 20M
Column length (m) 25.100.100.2.
Carrier gas    Hydrogen
Substrate    Gas-Chrom Z (80-100 mesh)
Column diameter (mm) 0.20.250.25
Phase thickness (μm)
Tstart (C) 70.70.70.65.
Tend (C) 180.170.170.220.
Heat rate (K/min) 3.1.1.4.
Initial hold (min) 5.
Final hold (min)
I 1130.1135.1136.1135.
ReferenceMacLeod and Snyder, 1985Shibamoto and Jennings, 1977Shibamoto and Jennings, 1977Stancher and Pertoldi, 1967
Comment MSDC-RI MSDC-RI MSDC-RI MSDC-RI

Kovats' RI, polar column, temperature ramp

Data compiled by: NIST Mass Spectrometry Data Center, William E. Wallace, director

Column type CapillaryCapillaryCapillaryCapillaryCapillary
Active phase StabilwaxSupelcowax-10DB-WaxInnowaxSupelcowax-10
Column length (m) 30.30.30.30.30.
Carrier gas N2 HeHeHe
Substrate
Column diameter (mm) 0.320.250.320.250.32
Phase thickness (μm) 1.0.250.250.250.25
Tstart (C) 50.40.40.50.75.
Tend (C) 220.210.220.250.230.
Heat rate (K/min) 2.2.3.0.53.
Initial hold (min) 3.2.5.5.
Final hold (min) 15.33. 10.
I 1132.1128.1113.1115.1121.
ReferenceHazzit, Baaliouamer, et al., 2006Sylvestre, Pichette, et al., 2006Lopes, Strobl, et al., 2004Viña and Murillo, 2003Tzakou and Couladis, 2001
Comment MSDC-RI MSDC-RI MSDC-RI MSDC-RI MSDC-RI
Column type CapillaryCapillaryCapillaryCapillaryCapillary
Active phase Carbowax 20MCarbowax 20MCarbowax 20MSupelcowax-10Supelcowax-10
Column length (m) 50.50.25.30.30.
Carrier gas   N2
Substrate
Column diameter (mm) 0.320.320.25
Phase thickness (μm) 0.20.2
Tstart (C) 60.60.60.40.40.
Tend (C) 260.260.200.210.210.
Heat rate (K/min) 2.2.5.2.2.
Initial hold (min)    2.2.
Final hold (min)    120.120.
I 1121.1130.1113.1116.1124.
ReferenceVera and Chane-Ming, 1999Vera and Chane-Ming, 1999Kulkarni, Mallavarapu, et al., 1998Loayza, Abujder, et al., 1995Loayza, Abujder, et al., 1995
Comment MSDC-RI MSDC-RI MSDC-RI MSDC-RI MSDC-RI
Column type CapillaryCapillaryCapillaryCapillaryCapillary
Active phase Supelcowax-10DB-WaxSupelcowax-10Supelcowax-20MDB-Wax
Column length (m) 30.60.60.23.60.
Carrier gas  HeHeH2
Substrate
Column diameter (mm)  0.250.250.320.25
Phase thickness (μm)    0.30
Tstart (C) 40.40.35.50.40.
Tend (C) 210.200.200.200.220.
Heat rate (K/min) 2.2.3.3.2.
Initial hold (min) 2.2.5.1.10.
Final hold (min) 120. 20.
I 1115.1119.1130.1111.1116.
ReferenceLoayza, Abujder, et al., 1995Umano, Hagi, et al., 1994Wong and Tie, 1993Bicchi, Frattini, et al., 1988Umano and Shibamoto, 1988
Comment MSDC-RI MSDC-RI MSDC-RI MSDC-RI MSDC-RI
Column type CapillaryCapillaryCapillary
Active phase DB-WaxCarbowax 20MCarbowax 20M
Column length (m) 60.100.100.
Carrier gas
Substrate
Column diameter (mm) 0.250.280.28
Phase thickness (μm)
Tstart (C) 40.80.80.
Tend (C) 220.200.200.
Heat rate (K/min) 2.3.3.
Initial hold (min) 10.
Final hold (min)
I 1113.1109.1109.
ReferenceUmano and Shibamoto, 1988Bernhard, Shibamoto, et al., 1983Bernhard, Shibamoto, et al., 1983
Comment MSDC-RI MSDC-RI MSDC-RI

Normal alkane RI, polar column, custom temperature program

Data compiled by: NIST Mass Spectrometry Data Center, William E. Wallace, director

Column type CapillaryCapillaryCapillaryCapillaryCapillary
Active phase Innowax FSCDB-WaxInnowax FSCHP-InnowaxInnowax
Column length (m) 60.60.60.60.60.
Carrier gas HeliumHeliumHeliumHelium
Substrate
Column diameter (mm) 0.250.200.250.250.25
Phase thickness (μm) 0.250.250.250.250.33
Program 60 0C (10 min) 4 0C/min -> 220 0C (10 min) 1 oC/min -> 240 0C40 0C (3 min) 2 0C/min -> 150 0C 4 0C/min -> 220 0C (20 min) 5 0C/min -> 230 0C60 0C (10 min) 4 0C/min -> 220 0C (10 min) 1 0C/min -> 240 0Cnot specifiednot specified
I 1132.1116.1132.1132.1132.
ReferenceAkin, Saracoglu, et al., 2012Gyawali and Kim, 2012Demirci, Temel, et al., 2011Feng, Cui, et al., 2011Noorizadeh, Farmany, et al., 2011
Comment MSDC-RI MSDC-RI MSDC-RI MSDC-RI MSDC-RI
Column type CapillaryCapillaryCapillaryCapillaryCapillary
Active phase HP InnowaxInnowax FSCInnowax FSCDB-WaxDB-Wax
Column length (m) 60.60.60.60.15.
Carrier gas  HeliumHeliumHeliumHelium
Substrate
Column diameter (mm) 0.250.250.250.250.25
Phase thickness (μm) 0.330.250.250.250.25
Program not specified60 0C (10 min) 4 0C/min -> 220 0C (10 min) 1 0C/min -> 240 0C60 0C (10 min) 4 0C/min -> 220 0C (10 min) 1 0C/min -> 240 0C40 0C (3 min) 2 0C/min -> 150 0C 4 0C/min -> 220 0C (20 min)50 0C (5 min) 6 0C/min -> 125 0C 10 0C/min -> 170 0C
I 1132.1132.1132.1119.1107.
ReferenceNoorizadeh and Farmany, 2010Polatoglu, Demirci, et al., 2010Baser, Demirci, et al., 2009Gyawali and Kim, 2009Keefover-Ring, Thompson, et al., 2009
Comment MSDC-RI MSDC-RI MSDC-RI MSDC-RI MSDC-RI
Column type CapillaryCapillaryCapillaryCapillaryCapillary
Active phase DB-WaxHP InnowaxHP Innowax FSPInnowaxHP-Innowax
Column length (m) 15.50.60.30.50.
Carrier gas HeliumHeliumHeliumHeliumHe
Substrate
Column diameter (mm) 0.250.200.250.250.2
Phase thickness (μm) 0.250.250.250.250.2
Program 50 0C (5 min) 6 0C/min -> 125 0C 10 0C/min -> 170 0C40 0C (5 min) 2 0C/min -> 270 0C -> 260 0C (20 min)60 0C (10 min) 4 0C/min -> 220 0C (10 min) 1 0C/min -> 240 0C (20 min)not specified40C(5min) => 2C/min => 250C(15min) => 10C/min => 270C
I 1111.1132.1132.1125.1132.
ReferenceKeefover-Ring, Thompson, et al., 2009Mancini, Arnold, et al., 2009Wedge, Klun, et al., 2009Aicha, Ines, et al., 2008Formisano, Mignola, et al., 2007
Comment MSDC-RI MSDC-RI MSDC-RI MSDC-RI MSDC-RI
Column type CapillaryCapillaryCapillaryCapillaryCapillary
Active phase Carbowax 20MInnowax FSCCarbowax 20MInnowax FSCHP Innowax FSP
Column length (m) 30.60.30.60.60.
Carrier gas HeNitrogenHeHeN2
Substrate
Column diameter (mm) 0.250.25 0.250.25
Phase thickness (μm) 0.250.25 0.250.25
Program not specified60 0C (10 min) 1 0C/min -> 220 0C (10 min) 1 0C/min -> 240 0C60C(5min) => 3C/min => 180C => 20C/min => 280C(10min)60C(10min) => 4C/min => 220C (10min) => 1C/min => 240C60C(10min) => 4C/min => 220C(10min) => 1C/min => 240C
I 1130.1132.1128.1132.1132.
ReferenceHudaib and Aburjai, 2007Kaya, Benirci, et al., 2007Merle, Verdeguer, et al., 2007Tabanca, Demirci, et al., 2007Tabanca N., Demirci B., et al., 2007
Comment MSDC-RI MSDC-RI MSDC-RI MSDC-RI MSDC-RI
Column type CapillaryCapillaryCapillaryCapillaryCapillary
Active phase Innowax FSCHP-Innowax FSCHP-Innowax FSCInnowax FSCHP-Innowax FSC
Column length (m) 60.60.60.60.60.
Carrier gas HeN2HeN2He
Substrate
Column diameter (mm) 0.250.250.250.250.25
Phase thickness (μm) 0.250.250.250.250.25
Program 60C(10min) => 4C/min >220C (10min) => 1C/min => 240C60C(10min) => 4C/min => 220C(10min) => 1C/min => 240C60C(10min) => 4C/min => 220C (10min) => 1C/min => 240C60C(10min) => 4C/min => 220C(10min) => 1C/min => 240C60C(10min) => 4C/min => 220C (10min) => 1C/min => 240C
I 1132.1132.1132.1132.1132.
ReferenceBaser, Özek, et al., 2006Demirci B., Baser K.H.C., et al., 2006Erdurak, Coskun, et al., 2006Iscan, Kirimer, et al., 2006Kürkçüoglu, Hüsnü Can Baser, et al., 2006
Comment MSDC-RI MSDC-RI MSDC-RI MSDC-RI MSDC-RI
Column type CapillaryCapillaryCapillaryCapillaryCapillary
Active phase Carbowax 20MHP-Innowax FSCHP-Innowax FSCHP-Innowax FSCInnowax FSC
Column length (m) 25.60.60.60.60.
Carrier gas H2He N2He
Substrate
Column diameter (mm) 0.320.250.250.250.25
Phase thickness (μm) 0.250.250.250.250.25
Program 40C(8min) => 3C/min => 180C => 20C/min => 230C (10min)60(10min) => 4C/min => 220C(10min) => 1C/min => 240C60C(10min) => 4C/min => 220C (10min) => 1C/min => 240C60C(10min) => 4C/min => 220C => (10min) => 1C/min => 240C60C(10min) => 4C/min => 220C (10min) => 1C/min => 240C
I 1074.1132.1132.1132.1132.
ReferenceLorenzo, Loayza, et al., 2006Suleimenov Y.M., Atazhanova G.A., et al., 2006Tabanca, Demirci, et al., 2006Tabanca, Demirci, et al., 2006, 2Tosun, Kürkcüoglu, et al., 2006
Comment MSDC-RI MSDC-RI MSDC-RI MSDC-RI MSDC-RI
Column type CapillaryCapillaryCapillaryCapillaryCapillary
Active phase Supelcowax-10HP-InnowaxHP-Innowax FSCDB-WaxInnowax FSC
Column length (m) 30.60.60.30.60.
Carrier gas HeN2N2HeHe
Substrate
Column diameter (mm) 0.250.250.250.250.25
Phase thickness (μm) 0.250.250.250.250.25
Program 40C(3min) => 4C/min => 75C => 8C/min => 260C(5min)60C(10min) => 4C/min => 220C (10min) => 1C/min => 240C60C(10min) => 4C/min => 220C (10min) => 1C/min => 240C35C(5min) => 2C/min => 173C(1min) => 15C/min => 210C(5min)60C(10min) => 4C/min => 220C(10min) => 1C/min => 240C
I 1115.1132.1132.1087.1132.
ReferenceVichi, Guadayol, et al., 2006Demirci, Demirci, et al., 2005Demirci, Demirci, et al., 2005, 2Giuseppe, Manuela, et al., 2005Kosar, Özek, et al., 2005
Comment MSDC-RI MSDC-RI MSDC-RI MSDC-RI MSDC-RI
Column type CapillaryCapillaryCapillaryCapillaryCapillary
Active phase DB-WaxHP-Innowax FSCHP-Innowax FSCHP-Innowax FSCHP-Innowax FSC
Column length (m)  60.60.60.60.
Carrier gas N2HeHeHeHe
Substrate
Column diameter (mm)  0.250.250.250.25
Phase thickness (μm)  0.250.250.250.25
Program not specified60C(10min) => 4C/min => 220C(10min) => 1C/min => 240C60C(10min) => 4C/min => 220C(10min) => 1C/min => 240C60C(10min) => 4C/min => 220C(10min) => 1C/min => 240C60C(10min) => 4C/min => 220C(10min) => 1C/min => 240C
I 1113.1132.1132.1132.1132.
ReferencePala-Paul, Perez-Alonso, et al., 2005Sezik E., Kocakulak E., et al., 2005Tabanca, Demirci, et al., 2005Viljoen, Subramoney, et al., 2005Kivcak, Akay, et al., 2004
Comment MSDC-RI MSDC-RI MSDC-RI MSDC-RI MSDC-RI
Column type CapillaryCapillaryCapillaryCapillaryCapillary
Active phase HP-Innowax FSCHP-InnowaxCarbowax 20MCarbowax 20MHP-Innowax FSC
Column length (m) 60.50.  60.
Carrier gas He   He
Substrate
Column diameter (mm) 0.250.2  0.25
Phase thickness (μm) 0.250.2  0.25
Program 60C(10min) => 4C/min => 220C(10min) => 1C/min => 240Cnot specifiednot specifiednot specified60C (10min) => 4C/min => 220C (10min) => 1C/min => 240C
I 1132.1132.1124.1130.1132.
ReferenceKivcak, Akay, et al., 2004Senatore, Apostolides Arnold, et al., 2004Vinogradov, 2004Vinogradov, 2004Demirci, Baser, et al., 2003
Comment MSDC-RI MSDC-RI MSDC-RI MSDC-RI MSDC-RI
Column type CapillaryCapillaryCapillaryCapillaryCapillary
Active phase CarbowaxHP-Innowax FSCHP-Innowax FSCHP-FFAPHP-Innowax
Column length (m)  60.60.30.60.
Carrier gas  N2HeHe
Substrate
Column diameter (mm)  0.250.250.250.25
Phase thickness (μm)  0.250.25 0.25
Program not specified60C(10min) => 4C/min => 220C(10min) => 1C/min => 240C60C(10min) => 4C/min => 220C(10min) => 1C/min => 240C(40min)60C (2min) => 5C/min => 160C (1min) => 10C/min => 230C (12min)60C(10min) => 4C/min => 220C(10min) => 1C/min => 240C
I 1125.1132.1132.1147.1132.
ReferenceEdris, Shalaby, et al., 2003Kaya, Demirci, et al., 2003Kürkcüoglu, Demirci, et al., 2003Mockute and Judzentiene, 2003Viljoen, van Vuuren, et al., 2003
Comment MSDC-RI MSDC-RI MSDC-RI MSDC-RI MSDC-RI
Column type CapillaryCapillaryCapillaryCapillaryCapillary
Active phase HP-InnowaxInnowax FSCInnowaxHP-InnowaxHP-Innowax FSC
Column length (m) 60.60.60.60.60.
Carrier gas HeHeHeHeN2
Substrate
Column diameter (mm) 0.250.250.250.250.25
Phase thickness (μm) 0.250.250.250.250.25
Program 60 0C (10 min) 4 K/min -> 220 0C (10 min) 1 K/min -> 240 0C60C(10min) => 4C/min => 220C(10min) => 1C/min => 240C60C(10min) => 4C/min => 220C(10min) => 1C/min => 240C60 0C (10 min) 4 K/min -> 220 0C (10 min) 1 K/min -> 240 0C60C(10min) => 4C/min => 220C(10min) => 1C/min => 240C
I 1132.1132.1132.1132.1132.
ReferenceBaser, Demirci, et al., 2002Baser, Demirei, et al., 2002Baser, Nuriddinov, et al., 2002Demirci, Baser, et al., 2002Hüsnü Can Baser, Demirci, et al., 2002
Comment MSDC-RI MSDC-RI MSDC-RI MSDC-RI MSDC-RI
Column type CapillaryCapillaryCapillaryCapillaryCapillary
Active phase HP-FFAPInnowaxInnowax FSCHP-InnowaxHP-Innowax
Column length (m) 25.50.60.60.60.
Carrier gas He  HeHe
Substrate
Column diameter (mm) 0.220.20.250.250.25
Phase thickness (μm)  0.20.250.250.25
Program 60C(2min) => 5C/min => 160C(1min) => 10C/min => 230C(12min)not specified60C(10min) => 4C/min => 220C(10min) => 1C/min => 240C60 0C (10 min) 10 K/min -> 220 0C (10 min) 1K/min -> 240 0C60 0C (10 min) 4 K/min -> 220 0C (10 min) 1 K/min -> 240 0C
I 1147.1148.1132.1132.1132.
ReferenceMockute and Judzentiene, 2002Stashenko, Jaramillo, et al., 2002Tunalier, Kirimer, et al., 2002Baser, Demirci, et al., 2001Gören, Demirci, et al., 2001
Comment MSDC-RI MSDC-RI MSDC-RI MSDC-RI MSDC-RI
Column type CapillaryCapillaryCapillaryCapillaryCapillary
Active phase HP-Innowax FSCInnowaxInnowax FSCInnowax FSCHP-Innowax FSC
Column length (m) 60.60.60.60.60.
Carrier gas HeHeHeHe
Substrate
Column diameter (mm) 0.250.250.250.250.25
Phase thickness (μm) 0.250.250.250.250.25
Program 60C(10min) => 4C/min => 220C(10min) => 1C/min => 240C60C(10min) => 4C/min => 200C(10min) => 1C/min => 240C60C(10min) => 4C/min => 220C(10min) => 1C/min => 240C60C(10min) => 4C/min => 220C(10min) => 1C/min => 240C60C(10min) => 4C/min => 220C(10min) => 1C/min => 240C
I 1132.1132.1132.1132.1132.
ReferenceKirimer N., Tabanea N., et al., 2001Özcan, Akgül, et al., 2001Saglam, Gozler, et al., 2001Tabanca N., Demirci F., et al., 2001Tabanca, Kirimer, et al., 2001
Comment MSDC-RI MSDC-RI MSDC-RI MSDC-RI MSDC-RI
Column type CapillaryCapillaryCapillaryCapillaryCapillary
Active phase HP-WaxInnowaxInnowaxInnowaxRTX-Wax
Column length (m) 60.60.60.60.30.
Carrier gas HeHeHeHeHe
Substrate
Column diameter (mm) 0.250.250.250.250.25
Phase thickness (μm) 0.250.250.250.250.25
Program 50 0C 3 K/min -> 200 0C 8 K/min -> 280 0C60 0C (10 min) 4 K/min -> 220 0C (10 min) 1 K/min -> 240 0C60 0C (10 min) 4 K/min -> 220 0C (10 min) 1 K/min -> 240 0C60 0C (10 min) 4 K/min -> 220 0C (10 min) 1 K/min -> 240 0Cnot specified
I 1125.1132.1132.1132.1092.
ReferenceUsubillaga, Aparicio, et al., 2001Baser, Özek, et al., 2000Baser, Özek, et al., 2000, 2Baser, Tabanca, et al., 2000Kéita, Vincent, et al., 2000
Comment MSDC-RI MSDC-RI MSDC-RI MSDC-RI MSDC-RI
Column type CapillaryCapillaryCapillaryCapillaryCapillary
Active phase Innowax FSCSupelcowax-10HP-Innowax FSCInnowax FSCCP-Wax 52CB
Column length (m) 60. 60.60.50.
Carrier gas He HeHeliumHe
Substrate
Column diameter (mm) 0.25 0.250.250.25
Phase thickness (μm) 0.25 0.250.250.2
Program 60C(10 min) => 4C/min => 220C(10min) => 1C/min => 240Cnot specified60C(10min) => 4C/min => 220C(10min) => 1C/min => 240C60 0C (10 min) 4 0C/min -> 220 0C (10 min) 1 0C/min -> 240 0C30C (1.5min) => 3C/min => 120C => 10C/min => 220C (3.5min)
I 1132.1124.1132.1132.1117.
ReferenceKirimer, Tabanca, et al., 2000Zunino, Lopez, et al., 2000Bagci, Baser, et al., 1999Kirimer, Tabanca, et al., 1999Jakobsen, Hansen, et al., 1998
Comment MSDC-RI MSDC-RI MSDC-RI MSDC-RI MSDC-RI
Column type CapillaryCapillaryCapillaryCapillaryCapillary
Active phase FFAPCarbowax 20MCarbowax 20MNB-351NB-351
Column length (m) 25. 60.25.25.
Carrier gas H2 He He
Substrate
Column diameter (mm) 0.2 0.250.320.32
Phase thickness (μm) 0.33 0.250.20.2
Program 40C(5min) => 4C/min => 170C => 8C/min => 240C (12min)not specifiednot specified40C(5min) => 4C/min => 170C => 8C/min => 240C (12min)35C(5min) => 2.5C/min => 150C => 5C/min => 240C (20min)
I 1105.1100.1120.1117.1111.
ReferenceReddy, Angers, et al., 1998Vernin, Lageot, et al., 1998Tirado, Stashenko, et al., 1995Kerrola, Galambosi, et al., 1994Kerrola and Kallio, 1994
Comment MSDC-RI MSDC-RI MSDC-RI MSDC-RI MSDC-RI
Column type CapillaryCapillary
Active phase CP-Wax 52CBCarbowax 20M
Column length (m) 50.
Carrier gas
Substrate
Column diameter (mm) 0.32
Phase thickness (μm)
Program not specifiednot specified
I 1100.1130.
ReferenceVernin, 1991Shibamoto, 1987
Comment MSDC-RI MSDC-RI

Kovats' RI, polar column, isothermal

Data compiled by: NIST Mass Spectrometry Data Center, William E. Wallace, director

Column type CapillaryCapillaryCapillaryCapillaryCapillary
Active phase Carbowax 20MCarbowax 20MCarbowax 20MCarbowax 20MCarbowax 20M
Column length (m)    152.150.
Carrier gas
Substrate
Column diameter (mm)    0.80.75
Phase thickness (μm) 0.50.50.5
Temperature (C) 100.70.90.70.70.
I 1136.1132.91133.1136.1130.
ReferenceSaeed, Redant, et al., 1979Saeed, Redant, et al., 1979Saeed, Redant, et al., 1979Kepner, Ellison, et al., 1974Malingré and Maarse, 1974
Comment MSDC-RI MSDC-RI MSDC-RI MSDC-RI MSDC-RI

Kovats' RI, polar column, custom temperature program

Data compiled by: NIST Mass Spectrometry Data Center, William E. Wallace, director

Column type CapillaryCapillary
Active phase HP-InnowaxCarbowax
Column length (m) 30.127.
Carrier gas H2
Substrate
Column diameter (mm) 0.320.75
Phase thickness (μm) 0.50
Program 60 0C (8 min) 3 K/min -> 180 0C 20 K/min -> 230 0C (20 min)not specified
I 1125.1134.
ReferenceFrizzo, Serafini, et al., 2001Okamoto, Ellison, et al., 1981
Comment MSDC-RI MSDC-RI

Phase change data

Data compiled as indicated in comments:
BS - Robert L. Brown and Stephen E. Stein
TRC - Thermodynamics Research Center, NIST Boulder Laboratories, Chris Muzny director

Quantity Value Units Method Reference Comment
Tboil436.7KN/AAldrich Chemical Company Inc., 1990BS
Tboil437.KN/AWallach, 1906Uncertainty assigned by TRC = 4. K; TRC

In addition to the Thermodynamics Research Center (TRC) data available from this site, much more physical and chemical property data is available from the following TRC products:

References

Bendiabdellah, El Amine Dib, et al., 2012
Bendiabdellah, A.; El Amine Dib, M.; Djabou, N.; Allali, H.; Tabti, B.; Costa, J.; Myseli, A., Biological activities and volatile cinstituents of Daucus muricatus L. from Algeria, Chem. Centr. J., 2012, 6, 48, 1-22. [all data]

Feng, Cui, et al., 2011
Feng, T.; Cui, J.-J.; Xiao, Z.-B.; Tian, H.-X.; Yi, F.-P.; Ma, X., Chemical composition od essential oil from the peel of Chinese Torreya grandis Frt, Org. Chem. International, 2011, 2011, 1-5, https://doi.org/10.1155/2011/187372 . [all data]

Menichini, Tundis, et al., 2011
Menichini, F.; Tundis, R.; Bonesi, M.; de Cindio, B.; Loizzo, M.R.; Conforti, F.; Statti, G.A.; Menabeni, R.; Bettini, R.; Menichini, F., Chemical composition and bioactivity of Citrus medica L. cv. Diamante essential oil obtained by hydrodistillation, cold-pressing and supercritical carbon dioxide extraction, Nat. Prod. Res., 2011, 25, 8, 789-799, https://doi.org/10.1080/14786410902900085 . [all data]

Dib, Djabou, et al., 2010
Dib, M.ElA.; Djabou, N.; Desjobert, L.-M.; Allali, H.; Tabti, B.; Muselli, A.; Costa, J., Characterization of volatile compounds of Daucus crinitus Desf. headspace solid phase microextraction as alternative technique to hydrodistillation, Chem, Centr. J., 2010, 4, 16, 1-15. [all data]

Mishra, Chaudhary, et al., 2010
Mishra, R.K.; Chaudhary, S.; Pandey, R.; Gupta, S.; Mallavarapu, G.R.; Kumar, S., Analysis of linalool content in the inflorescence (flower) essential oil and leaf oil of Lippia alba cultivar Kavach, J. Essen. Oil Res., 2010, 22, 1, 3-7, https://doi.org/10.1080/10412905.2010.9700253 . [all data]

Neves, Rosa, et al., 2010
Neves, A.; Rosa, S.; Goncalves, J.; Rufino, A.; Judas, F.; Salgueiro, L.; Lopes, M.C.; Cavaleiro, C.; Mendes, A.F., Screening of five essential oils for identification of potential inhibitors of IL-1-unduced Nf-kB activation and NO production in human clondrocytes: characterization of the inhibitory activity of alpha-pinene, Plante Med., 2010, 76, 03, 303-308, https://doi.org/10.1055/s-0029-1186085 . [all data]

Benites, Moiteiro, et al., 2009
Benites, J.; Moiteiro, C.; Miguel, G.; Rojo, L.; Lopez, J.; Venancio, F.; Ramalho, L.; Feio, S.; Dandlen, S.; Casanova, H.; Torres, I., Composition and biological activity of the essential oil of Peruvial Lantana camara, J. Chilean Chem. Soc., 2009, 54, 4, 379-384, https://doi.org/10.4067/S0717-97072009000400012 . [all data]

Karlsson, Birgersson, et al., 2009
Karlsson, M.F.; Birgersson, G.; Prado, A.M.C.; Bosa, F.; Bengtsson, M.; Witzgall, P., Plant Odor Analysis of Potato: Responce of Guatemalan Moth to Above- and Background Potato Volatiles, J. Agric. Food Chem., 2009, 57, 13, 5903-5909, https://doi.org/10.1021/jf803730h . [all data]

Museli, Pau, et al., 2009
Museli, A.; Pau, M.; Desjobert, J.-M.; Foddai, M.; Usai, M.; Costa, J., Volatile constituents of Achllea ligustica All. by HS-SPME/GC/GC-MS. Comparison with essential oils obtained by hydrodistillation from Corsica and Sardinia, Chromatographia, 2009, 69, 5/6, 575-585, https://doi.org/10.1365/s10337-008-0939-1 . [all data]

Seo, Kim, et al., 2009
Seo, S.-M.; Kim, J.; Lee, S.-G.; Shin, C.-H.; Shin, S.-C.; Park, I.-K., Fumigant antitermitic activity of plant essential oils and components from Aiowan (Trachyspermum ammi), Allspice (Pimenta dioica), Caraway (Carum carvi), Dill (Anethum graveolens), Geranium (Pelargonium graveolens), and Litsea (Litsea cubeba( oils against Japanese termite (Reticulitermes speratus Kolbe), J. Agric. Food Chem., 2009, 57, 15, 6596-6602. [all data]

Shimizu, Imayoshi, et al., 2009
Shimizu, Y.; Imayoshi, Y.; Kato, M.; Maeda, K.; Iwabuchi, H.; Shimomura, K., Volatiles from leaves of field-grown plants and shoot cultures of Gynura bicolor DC, Flavour Fragr. J., 2009, 24, 5, 251-258, https://doi.org/10.1002/ffj.1938 . [all data]

Wannes, Mhamdi, et al., 2009
Wannes, W.A.; Mhamdi, B.; Marzouk, B., GC comparative analysis of least essential oils from two Myrtle varieties at different phenological stages, Chromatographia, 2009, 69, 1/2, 145-150, https://doi.org/10.1365/s10337-008-0818-9 . [all data]

Capetanos, Saroglou, et al., 2007
Capetanos, C.; Saroglou, V.; Marin, P.D.; Simic, A.; Skaltsa, H.D., Essential oil snalysis of two endemic Eringium species from Serbia, J. Serb. Chem. Soc., 2007, 72, 10, 961-965, https://doi.org/10.2298/JSC0710961C . [all data]

Cheraif, Ben Jannet, et al., 2007
Cheraif, I.; Ben Jannet, H.; Hammami, M.; Khouja, M.L.; Mighri, Z., Chemical composition and antimicrobial activity of essential oils of Cupressus arizonica Greene, Biochem. Syst. Ecol., 2007, 35, 12, 813-820, https://doi.org/10.1016/j.bse.2007.05.009 . [all data]

Chyau, Tsai, et al., 2007
Chyau, C.-C.; Tsai, S.-Y.; Yang, J.-H.; Weng, C.-C.; Han, C.-M.; Shih, C.-C.; Mau, J.-L., The essential oil of Glossogyne tenuifolia, Food Chem., 2007, 100, 2, 808-812, https://doi.org/10.1016/j.foodchem.2005.10.044 . [all data]

Formisano, Rigano, et al., 2007
Formisano, C.; Rigano, D.; Napolitano, F.; Senatore, F.; Arnold, N.A.; Piozzi, F.; Rosselli, S., Volatile constituents of Calamintha ariganifolia Boiss. growing wild in Lebanon, Natural Product Communications, 2007, 2, 12, 1253-1256. [all data]

Gil A., Van Baren C.M., et al., 2007
Gil A.; Van Baren C.M.; Lira P.M.D.L.; Bandoni A.L., Identification of the genotype from the content and composition of the essential oil of lemon verbena (Aloysia citriodora Palau), J. Agric. Food Chem., 2007, 55, 21, 8664-8669, https://doi.org/10.1021/jf0708387 . [all data]

Hachicha, Skanji, et al., 2007
Hachicha, S.F.; Skanji, T.; Barrek, S.; Ghrabi, Z.G.; Zarrouk, H., Composition of the essential oil of Teucrium ramosissimum Desf. (Lamiaceae) from Tunisia, Flavour Fragr. J., 2007, 22, 2, 101-104, https://doi.org/10.1002/ffj.1764 . [all data]

Hymete, Rohloff, et al., 2007
Hymete, A.; Rohloff, J.; Iversen, T.-H.; Kjosen, H., Volatile constituents of the roots of Echinops kebericho Mesfin, Flavour Fragr. J., 2007, 22, 1, 35-38, https://doi.org/10.1002/ffj.1746 . [all data]

Kurose, Okamura, et al., 2007
Kurose, K.; Okamura, D.; Yatagai, M., Composition of the essential oils from the leaves of nine Pinus species and the cones of three of Pinus species, Flavour Fragr. J., 2007, 22, 1, 10-20, https://doi.org/10.1002/ffj.1609 . [all data]

Limberger, Scopel, et al., 2007
Limberger, R.P.; Scopel, M.; Sobral, M.; Henriques, A.T., Comparative analysis of volatiles from Drimys brasiliensis Miers and D. angustifolia Miers (Winteraceae) from Southern Brazil, Biochem. Syst. Ecol., 2007, 35, 3, 130-137, https://doi.org/10.1016/j.bse.2006.09.007 . [all data]

Pala-Paul, Brophy, et al., 2007
Pala-Paul, J.; Brophy, J.J.; Perez-Alonso, M.J.; Usano, J.; Soria, S.C., Essential oil composition of the different parts of Eryngium corniculatum Lam. (Apiaceae) from Spain, J. Chromatogr. A, 2007, 1175, 2, 289-293, https://doi.org/10.1016/j.chroma.2007.10.061 . [all data]

Pinto, Salgueiro, et al., 2007
Pinto, E.; Salgueiro, L.R.; Cavaleiro, C.; Palmeira, A.; Goncalves, M.J., In vitro susceptibility of some species of yeasts and filamentous fungi to essential oils of Salvia of?cinalis, Ind. Crops Prod., 2007, 26, 2, 135-141, https://doi.org/10.1016/j.indcrop.2007.02.004 . [all data]

Povolo, Contarini, et al., 2007
Povolo, M.; Contarini, G.; Mele, M.; Secchiari, P., Study on the influence of pasture on volatile fraction of Ewes' dairy products by solid-phase microextraction and gas chromatography-mass spectrometry, J. Dairy Sci., 2007, 90, 2, 556-569, https://doi.org/10.3168/jds.S0022-0302(07)71539-4 . [all data]

Raal, Orav, et al., 2007
Raal, A.; Orav, A.; Arak, E.; Kailas, T.; Müürisepp, M., Variation in the composition of the essential oil of Valeriana officinalis L. roots from Estonia, Proc. Est. Acad. Sci. Chem., 2007, 56, 2, 67-74. [all data]

Singh, Kumar, et al., 2007
Singh, B.; Kumar, R.; Bhandari, S.; Pathania, S.; Lal, B., Volatile constituents of natural Boswellia serrata oleo-gum-resin and commercial samples, Flavour Fragr. J., 2007, 22, 2, 145-147, https://doi.org/10.1002/ffj.1772 . [all data]

Sylvestre, Longtin, et al., 2007
Sylvestre, M.; Longtin, A.P.A.; Legault, J., Volatile leaf condtituents and anticancer activity of Bursera simaruba (L.) Sarg. essential oil, Natural Product Communications, 2007, 2, 12, 1273-1276. [all data]

Sylvestre, Pichette, et al., 2007
Sylvestre, M.; Pichette, A.; Longtin, A.; Martin, M.-A.C.; Bercion, S.R.; Legault, J., Chemical composition of leaf essential oil of Hedyosmum arborescens and evaluation of its anticancer activity, Natural Product Communications, 2007, 2, 12, 1269-1272. [all data]

Vichi, Riu-Aumatell, et al., 2007
Vichi, S.; Riu-Aumatell, M.; Mora-Pons, M.; Guadayol, J.M.; Buxaderas, S.; López-Tamames, E., Analytical, Nutritional and Clinical Methods. HS-SPME coupled to GC/MS for quality control of Juniperus communis L. berries used for gin aromatization, Food Chem., 2007, 105, 4, 1748-1754, https://doi.org/10.1016/j.foodchem.2007.03.026 . [all data]

Wei A. and Shibamoto T., 2007
Wei A.; Shibamoto T., Antioxidant activities and volatile constituents of various essential oils, J. Agric. Food Chem., 2007, 55, 5, 1737-1742, https://doi.org/10.1021/jf062959x . [all data]

Abdelwahed, Hayder, et al., 2006
Abdelwahed, A.; Hayder, N.; Kilani, S.; Mahmoud, A.; Chibani, J.; Hammami, M.; Chekir-Ghedira, L.; Ghedira, K., Chemical composition and antimicrobial activity of essential oils from Tunisian Pituranthos tortuosus (Coss.) Maire, Flavour Fragr. J., 2006, 21, 1, 129-133, https://doi.org/10.1002/ffj.1542 . [all data]

Borges, Rojas, et al., 2006
Borges, R.; Rojas, L.B.; Cegarra, J.A.; Usubillaga, A., Study of the essential oils from the leaves and flowers of Lepechinia conferta (Benth) Epl., Flavour Fragr. J., 2006, 21, 1, 155-157, https://doi.org/10.1002/ffj.1550 . [all data]

Cavaleiro, Pinto, et al., 2006
Cavaleiro, C.; Pinto, E.; Gonsales, M.J.; Salguero, L., Antifungal activity of Juniperus essential oils agains dermatophyte, Asrgillus and Candida strains, J. Appl. Microbiol., 2006, 100, 6, 1333-1338, https://doi.org/10.1111/j.1365-2672.2006.02862.x . [all data]

Choi, 2006
Choi, H.-S., Headspace analyses of fresh leaves and stems of Angelica gigas Nakai, a Korean medicinal herb, Flavour Fragr. J., 2006, 21, 4, 604-608, https://doi.org/10.1002/ffj.1602 . [all data]

Fanciullino, Tomi, et al., 2006
Fanciullino, A.-L.; Tomi, F.; Luro, F.; Desjobert, J.M.; Casanova, J., Chemical variability of peel and leaf oils of mandarins, Flavour Fragr. J., 2006, 21, 2, 359-367, https://doi.org/10.1002/ffj.1658 . [all data]

Filippi, Lanfranchi, et al., 2006
Filippi, J.-J.; Lanfranchi, D.-A.; Prado, S.; Baldovini, N.; Meierhenrich, U.J., Composition, Enantiomeric Distribution, and Antibacterial Activity of the Essential Oil of Achillea ligustica All. from Corsica, J. Agric. Food Chem., 2006, 54, 17, 6308-6313, https://doi.org/10.1021/jf060752y . [all data]

Hymete, Rohloff, et al., 2006
Hymete, A.; Rohloff, J.; Iversen, T.-H., Essential oil from seeds and husks of Aframomum corrorima from Ethiopia, Flavour Fragr. J., 2006, 21, 4, 642-644, https://doi.org/10.1002/ffj.1634 . [all data]

Kitchlu, Bakshi, et al., 2006
Kitchlu, S.; Bakshi, S.K.; Kaul, M.K.; Bhan, M.K.; Thapa, R.K.; Agarwal, S.G., Tanacetum gracile Hook. f T. A new source of lavandulol from Ladakh Himalaya (India), Flavour Fragr. J., 2006, 21, 4, 690-692, https://doi.org/10.1002/ffj.1674 . [all data]

Lan Phi N.T., Nishiyama C., et al., 2006
Lan Phi N.T.; Nishiyama C.; Choi H.-S.; Sawamura M., Evaluation of aroma characteristic compounds of Citrus natsudaidai Hayata (Natsudaidai) cold-pressed peel oil, Biosci. Biotechnol. Biochem., 2006, 70, 8, 1832-1838, https://doi.org/10.1271/bbb.50705 . [all data]

Martin, Joseph, et al., 2006
Martin, M.A.C.K.; Joseph, H.; Bercion, S.; Menut, C., Chemical composition of essential oils from aerial parts of Aframomum exscapum (Sims) Hepper collected in Guadeloupe, French West Indies, Flavour Fragr. J., 2006, 21, 6, 902-905, https://doi.org/10.1002/ffj.1741 . [all data]

Orav, Raal, et al., 2006
Orav, A.; Raal, A.; Arak, E.; Müürisepp, M.; Kailas, T., Composition of the essential oil of Artemisia absinthium L. of different geographical origin, Proc. Est. Acad. Sci. Chem., 2006, 55, 3, 155-165. [all data]

Sawamura, Onishi, et al., 2006
Sawamura, M.; Onishi, Y.; Ikemoto, J.; Tu, N.T.M.; Phi, N.T.L., Characteristic odour components of bergamot (Citrus bergamia Risso) essential oil, Flavour Fragr. J., 2006, 21, 4, 609-615, https://doi.org/10.1002/ffj.1604 . [all data]

Wong, Lim, et al., 2006
Wong, K.C.; Lim, T.B.; Ali, D.M.H., Essential oil of Homalomena sagittifolia Jungh., Flavour Fragr. J., 2006, 21, 5, 786-788, https://doi.org/10.1002/ffj.1714 . [all data]

Babu and Kaul, 2005
Babu, K.G.D.; Kaul, V.K., Variation in essential oil composition of rose-scented geranium (Pelargonium sp.) distilled by different distillation techniques, Flavour Fragr. J., 2005, 20, 2, 222-231, https://doi.org/10.1002/ffj.1414 . [all data]

Bendimerad and Bendiab, 2005
Bendimerad, N.; Bendiab, S.A.T., Composition and antibacterial activity of Pseudocytisus integrifolius (Salisb.) essential oil from Algeria, J. Agric. Food Chem., 2005, 53, 8, 2947-2952, https://doi.org/10.1021/jf047937u . [all data]

Ferretti, Maggi, et al., 2005
Ferretti, G.; Maggi, F.; Tirillini, B., Essential oil composition of Hypericum richeri Vill. from Italy, Flavour Fragr. J., 2005, 20, 3, 295-298, https://doi.org/10.1002/ffj.1412 . [all data]

Jirovetz, Buchbauer, et al., 2005
Jirovetz, L.; Buchbauer, G.; Ngassoum, M.B.; Parmentier, M., Chemical composition and olfactory characterization of essential oils of fruits and seeds of African pear (Dacryodes edulis (G. Don) H. J. Lam) from Cameroon, Flavour Fragr. J., 2005, 20, 2, 215-218, https://doi.org/10.1002/ffj.1324 . [all data]

Jirovetz, Buchbauer, et al., 2005, 2
Jirovetz, L.; Buchbauer, G.; Stoyanova, A.; Balinova, A.; Guangjiun, Z.; Xihan, M., Solid phase microextraction/gas chromatographic and olfactory analysis of the scent and fixative properties of the essential oil of Rosa damascena L. from China, Flavour Fragr. J., 2005, 20, 1, 7-12, https://doi.org/10.1002/ffj.1375 . [all data]

Kurose and Yatagai, 2005
Kurose, K.; Yatagai, M., Components of the essential oils of Azadirachta indica A. Juss, Azadirachta siamensis Velton, and Azadirachta excelsa (Jack) Jacobs and their comparison, J. Wood Sci., 2005, 51, 2, 185-188, https://doi.org/10.1007/s10086-004-0640-4 . [all data]

Njoroge, Koaze, et al., 2005
Njoroge, S.M.; Koaze, H.; Mwaniki, M.; Minh Tu, N.T.; Sawamura, M., Essential oils of Kenyan Citrus fruits: volatile components of two varieties of mandarins (Citrus reticulata) and a tangelo (C. paradisi × C. tangerina), Flavour Fragr. J., 2005, 20, 1, 74-79, https://doi.org/10.1002/ffj.1376 . [all data]

Njoroge, Koaze, et al., 2005, 2
Njoroge, S.M.; Koaze, H.; Karanja, P.N.; Sawamura, M., Essential oil constituents of three varieties of Kenyan sweet oranges (Citrus sinensis), Flavour Fragr. J., 2005, 20, 1, 80-85, https://doi.org/10.1002/ffj.1377 . [all data]

Palá-Paúl, Pérez-Alonso, et al., 2005
Palá-Paúl, J.; Pérez-Alonso, M.; Velasco-Negueruela, A.; Vadaré, J.; Villa, A.M.; Sanz, J.; Brophy, J.J., Analysis of the essential oil composition from the different parts of Eryngium glaciale Boiss. from Spain, J. Chromatogr. A, 2005, 1094, 1-2, 179-182, https://doi.org/10.1016/j.chroma.2005.09.029 . [all data]

Rohloff and Bones, 2005
Rohloff, J.; Bones, A.M., Volatile profiling of Arabidopsis thaliana - Putative olfactory compounds in plant communication, Phytochemistry, 2005, 66, 16, 1941-1955, https://doi.org/10.1016/j.phytochem.2005.06.021 . [all data]

Salehi, Sonboli, et al., 2005
Salehi, P.; Sonboli, A.; Eftekhar, F.; Nejad-Ebrahimi, S.; Yousefzadi, M., Essential Oil Composition, Antibacterial and Antioxidant Activity of the Oil and Various Extracts of Ziziphora clinopodioides subsp. rigida (BOISS.) RECH. f. from Iran, Biol. Pharm. Bull., 2005, 28, 10, 1892-1896, https://doi.org/10.1248/bpb.28.1892 . [all data]

Stevanovic, Garneau, et al., 2005
Stevanovic, T.; Garneau, F.-X.; Jean, F.-I.; Gagnon, H.; Vilotic, D.; Petrovic, S.; Ruzic, N.; Pichette, A., The essential oil composition of Pinus mugo Turra from Serbia, Flavour Fragr. J., 2005, 20, 1, 96-97, https://doi.org/10.1002/ffj.1390 . [all data]

Vichi, Riu-Aumatell, et al., 2005
Vichi, S.; Riu-Aumatell, M.; Mora-Pons, M.; Buxaderas, S.; Lopez-Tamames, E., Characterization of Volatiles in Different Dry Gins, J. Agric. Food Chem., 2005, 53, 26, 10154-10160, https://doi.org/10.1021/jf058121b . [all data]

Wong, Lee, et al., 2005
Wong, K.C.; Lee, B.C.; Lam, N.F.; Ibrahim, P., Essential oils of the rhizomes of Alpinia conchigera Griff. and Alpinia latilabris Ridl., Flavour Fragr. J., 2005, 20, 4, 431-433, https://doi.org/10.1002/ffj.1458 . [all data]

Wu, Krings, et al., 2005
Wu, S.; Krings, U.; Zorn, H.; Berger, R.G., Volatile compounds from the fruiting bodies of beefsteak fungus Fistulina hepatica (Schaeffer: Fr.) Fr., Food Chem., 2005, 92, 2, 221-226, https://doi.org/10.1016/j.foodchem.2004.07.013 . [all data]

Agnihotri, Thappa, et al., 2004
Agnihotri, V.K.; Thappa, R.K.; Meena, B.; Kapahi, B.K.; Saxena, R.K.; Qazi, G.N.; Agarwal, S.G., Essential oil composition of aerial parts of Angelica glauca growing wild in North-West Himalaya (India), Phytochemistry, 2004, 65, 16, 2411-2413, https://doi.org/10.1016/j.phytochem.2004.07.004 . [all data]

Choi, 2004
Choi, H.-S., Volatile constituents of satsuma mandarins growing in Korea, Flavour Fragr. J., 2004, 19, 5, 406-412, https://doi.org/10.1002/ffj.1283 . [all data]

Choi, 2004, 2
Choi, H.-S., Aroma evaluation of an aquatic herb, changpo (Acorus calamus Var. angustatus Bess), by AEDA and SPME, J. Agric. Food Chem., 2004, 52, 26, 8099-8104, https://doi.org/10.1021/jf040239p . [all data]

Gauvin, Ravaomanarivo, et al., 2004
Gauvin, A.; Ravaomanarivo, H.; Smadja, J., Comparative analysis by gas chromatography?mass spectrometry of the essential oils from bark and leaves of Cedrelopsis grevei Baill, an aromatic and medicinal plant from Madagascar, J. Chromatogr. A, 2004, 1029, 1-2, 279-282, https://doi.org/10.1016/j.chroma.2003.12.012 . [all data]

González, Guerra, et al., 2004
González, S.; Guerra, P.E.; Bottaro, H.; Molares, S.; Demo, M.S.; Oliva, M.M.; Zunino, M.P.; Zygadlo, J.A., Aromatic plants from Patagonia. Part I. Antimicrobial activity and chemical composition of Schinus polygamus (Cav.) Cabrera essential oil, Flavour Fragr. J., 2004, 19, 1, 36-39, https://doi.org/10.1002/ffj.1270 . [all data]

Jiang and Kubota, 2004
Jiang, L.; Kubota, K., Differences in the volatile components and their odor characteristics of green and ripe fruits and dried pericarp of Japanese pepper (Xanthoxylum piperitum DC.), J. Agric. Food Chem., 2004, 52, 13, 4197-4203, https://doi.org/10.1021/jf030663a . [all data]

Lopez Arze, Collin, et al., 2004
Lopez Arze, J.B.; Collin, G.; Garneau, F.-X.; Jean, F.-I.; Gagnon, H., Essential oils from Bolivia. II. Asteraceae: Ophryosporus heptanthus (Wedd.) H. Rob. et King, J. Essent. Oil Res., 2004, 16, 4, 374-376, https://doi.org/10.1080/10412905.2004.9698747 . [all data]

Lourens, Reddy, et al., 2004
Lourens, A.C.U.; Reddy, D.; Baser, K.H.C.; Viljoen, A.M.; Van Vuuren, S.F., In vitro Biological Activity and Essential Oil Composition of Four Indigenous South Africal Helichrysum Species, J. Ethnopharmacol., 2004, 95, 2-3, 253-258, https://doi.org/10.1016/j.jep.2004.07.027 . [all data]

Orav, Stulova, et al., 2004
Orav, A.; Stulova, I.; Kailas, T.; Müürisepp, M., Effect of storage on the essential oil composition of piper nigrum L. fruits of different ripening states, J. Agric. Food Chem., 2004, 52, 9, 2582-2586, https://doi.org/10.1021/jf030635s . [all data]

Palá-Paúl, García-Jiménez, et al., 2004
Palá-Paúl, J.; García-Jiménez, R.; Pérez-Alonso, M.J.; Velasco-Negueruela, A.; Sanz, J., Essential oil composition of the leaves and stems of Meum athamanticum Jacq., from Spain, J. Chromatogr. A, 2004, 1036, 2, 245-247, https://doi.org/10.1016/j.chroma.2004.02.064 . [all data]

Raal, Arak, et al., 2004
Raal, A.; Arak, E.; Orav, A., Chemical composition of coriander seed essential oil and their conformity with EP standards, Agraarteadus, 2004, 15, 4, 234-239. [all data]

Raal, Paaver, et al., 2004
Raal, A.; Paaver, U.; Arak, E.; Orav, A., Content and composition of the essential oil of Thymus serpyllum L. growing wild in Estonia, Medicina (Kaunas), 2004, 40, 8, 795-800. [all data]

Sawamura, Son, et al., 2004
Sawamura, M.; Son, U.-S.; Choi, H.-S.; Kim, M.-S.L.; Phi, N.T.L.; Fears, M.; Kumagai, Compositional changes in commercial lemon essential oil for aromatherapy, Int. J. Aromatherapy, 2004, 14, 1, 27-36, https://doi.org/10.1016/j.ijat.2004.02.001 . [all data]

Sawamura, Sou, et al., 2004
Sawamura, M.; Sou, U.-S.; Choi, H.-S.; Kim, M.-S.; Phi, N.T.L.; Fears, M.; Kumagai. C., Composition changes in commercial lemon essential oil for aromatherapy, Int. J. Aromatherapy, 2004, 14, 1, 27-36, https://doi.org/10.1016/j.ijat.2004.02.001 . [all data]

Bertoli, Menichini, et al., 2003
Bertoli, A.; Menichini, F.; Mazzetti, M.; Spinelli, G.; Morelli, I., Volatile constituents of the leaves and flowers of Hypericum triquetrifolium Turra, Flavour Fragr. J., 2003, 18, 2, 91-94, https://doi.org/10.1002/ffj.1161 . [all data]

Cabanillas, Lopez, et al., 2003
Cabanillas, C.M.; Lopez, M.L.; Daniele, G.; Zygadlo, J.A., Essential oil composition of Aloysia polystachya (Griseb.) Moldenke under rust disease, Flavour Fragr. J., 2003, 18, 5, 446-448, https://doi.org/10.1002/ffj.1249 . [all data]

Juteau, Jerkovic, et al., 2003
Juteau, F.; Jerkovic, I.; Masotti, V.; Milos, M.; Mastelic, J.; Bessière, J.-M.; Viano, J., Composition and antimicrobial activity of the essential oil of Artemisia absinthium from Croatia and France, Planta Medica, 2003, 69, 2, 158-161, https://doi.org/10.1055/s-2003-37714 . [all data]

Mastelic and Jerkovic, 2003
Mastelic, J.; Jerkovic, I., Application of co-distillation with superheated pentane vapour to the isolation of unstable essential oils, Flavour Fragr. J., 2003, 18, 6, 521-526, https://doi.org/10.1002/ffj.1261 . [all data]

Mookdasanit, Tamura, et al., 2003
Mookdasanit, J.; Tamura, H.; Yoshizawa T.; Tokunaga T.; Nakanishi, K., Trace Volatile Compounds in Essential Oil of Citrus Sudachi by Means of Modified Solvent Extraction Method, Food Sci Technol. Res., 2003, 9, 1, 54-61, https://doi.org/10.3136/fstr.9.54 . [all data]

Orav, Kailas, et al., 2003
Orav, A.; Kailas, T.; Jegorova, A., Composition of the essential oil of dill, celery, and parsley from Estonia, Proc. Est. Acad. Sci. Chem., 2003, 52, 4, 147-154. [all data]

Raal, Arak, et al., 2003
Raal, A.; Arak, E.; Orav, A.; Ivask, K., Comparison of essential oil content of Matricaria recutita L. from different origins, Ars Pharm., 2003, 44, 2, 159-165, retrieved from http://www.ugr.es/~ars/abstract/44-159-03.pdf. [all data]

Stashenko, Jaramillo, et al., 2003
Stashenko, E.E.; Jaramillo, B.E.; Martínez, J.R., Comparación de la composición química y de la actividad antioxidante in vitro de los metabolitos secundarios volátiles de plantas de la familia verbenaceae, Rev. Acad. Colomb. Cienc. Exactas Fis. Nat., 2003, 27, 105, 579-597. [all data]

Suleimenov, Atazharova, et al., 2003
Suleimenov, E.M.; Atazharova, G.A.; Demirchi, B.; Baser, K.H.C.; Adekenov, S.M., Essential oil composition of Artemisia Lercheana and A. Sieversiana of Kazakhstan flora in Recent problems of development of new medicines of natural origin, Proceedings of symposium, St.Petersburg - Pushkin, 2003, 382-385. [all data]

Tu, Onishi, et al., 2003
Tu, N.T.M.; Onishi, Y.; Son, U.S.; Ogawa, E.; Ukeda, H.; Sawamura, M., Characteristic odour components of Citrus inflata Hort. Ex Tanaka (Mochiyu) cold-pressed peel oil, Flavour Fragr. J., 2003, 18, 5, 454-459, https://doi.org/10.1002/ffj.1252 . [all data]

Tu, Onishi, et al., 2003, 2
Tu, N.T.M.; Onishi, Y.; Choi, H.S.; Kondo, Y.; Ukeda, H.; Sawamura, M., Characteristic odour components of Citrus sp. (Kiyookadaidai) cold-pressed peel oil, Flavour Fragr. J., 2003, 18, 6, 515-520, https://doi.org/10.1002/ffj.1260 . [all data]

Velasco-Negueruela, Pérez-Alonso, et al., 2003
Velasco-Negueruela, A.; Pérez-Alonso, M.J.; Pérez de Paz, P.L.; Palá-Paúl, J.; Sanz, J., Analysis by gas chromatography-mass spectrometry of the essential oils from the aerial parts of Rutheopsis herbanica (Bolle) Hans. Kunk., gathered in Fuerteventura (Canary Islands), J. Chromatogr. A, 2003, 984, 1, 159-162, https://doi.org/10.1016/S0021-9673(02)01742-9 . [all data]

Gancel, Ollé, et al., 2002
Gancel, A.-L.; Ollé, D.; Ollitrault, P.; Luro, F.; Brillouet, J.-M., Leaf and peel volatile compounds of an interspecific citrus somatic hybrid [Citrus aurantifolia (Christm.) Swing. + Citrus paradisi Macfayden], Flavour Fragr. J., 2002, 17, 6, 416-424, https://doi.org/10.1002/ffj.1119 . [all data]

Kasali, Winterhalter, et al., 2002
Kasali, A.A.; Winterhalter, P.; Adio, A.M.; Knapp, H.; Bonnlander, B., Chromenes in Ageratum conyzoides L., Flavour Fragr. J., 2002, 17, 4, 247-250, https://doi.org/10.1002/ffj.1099 . [all data]

Orav, Kailas, et al., 2002
Orav, A.; Kailas, T.; Müürisepp, M., Composition of blackcurrant aroma isolated from leaves, buds, and berries of Ribes nigrum L., Proc. Est. Acad. Sci. Chem., 2002, 51, 4, 225-234. [all data]

Priestap, van Baren, et al., 2002
Priestap, H.A.; van Baren, C.M.; Lira, P.D.L.; Prado, H.J.; Neugebauer, M.; Mayer, R.; Bandoni, A.L., Essential oils from aerial parts of Aristolochia gibertii Hook., Flavour Fragr. J., 2002, 17, 1, 69-71, https://doi.org/10.1002/ffj.1044 . [all data]

Tu, Onishi, et al., 2002
Tu, N.T.M.; Onishi, Y.; Choi, H.-S.; Kondo, Y.; Bassore, S.M.; Ukeda, H.; Sawamura, M., Characteristic odor components of Citrus sphaerocarpa Tanaka (Kabosu) cold-pressed peel oil, J. Agric. Food Chem., 2002, 50, 10, 2908-2913, https://doi.org/10.1021/jf011578a . [all data]

Tu, Thanh, et al., 2002
Tu, N.T.M.; Thanh, L.X.; Une, A.; Ukeda, H.; Sawamura, M., Volatile constituents of Vietnamese pummelo, orange, tangerine and lime peel oils, Flavour Fragr. J., 2002, 17, 3, 169-174, https://doi.org/10.1002/ffj.1076 . [all data]

Umano, Hagi, et al., 2002
Umano, K.; Hagi, Y.; Shibamoto, T., Volatile chemicals identified in extracts from newly hybrid citrus, dekopon (Shiranuhi mandarin Suppl. J.), J. Agric. Food Chem., 2002, 50, 19, 5355-5359, https://doi.org/10.1021/jf0203951 . [all data]

Chiasson, Bélanger, et al., 2001
Chiasson, H.; Bélanger, A.; Bostanian, N.; Vincent, C.; Poliquin, A., Acaricidal properties of Artemisia absinthium and Tanacetum vulgare (Asteraceae) essential oils obtained by three methods of extraction, J. Econ. Entomol., 2001, 94, 1, 167-171, https://doi.org/10.1603/0022-0493-94.1.167 . [all data]

Christoph, 2001
Christoph, F., Chemische Zuzammensetzung und antimikrobielle Eigenschaften der ätherischen Öle von Leptospermum scoparium J. R. et G. Forst. und anderer Teebaumöle der Gattungen Kunzea, Leptospermum und Melaleuca unter besonderer Berücksichtigung von Handelsölen, Dissertation, University of Hamburg, Germany, 2001, 196. [all data]

Jiang and Kubota, 2001
Jiang, L.; Kubota, K., Formation by mechanical stimulus of the flavor compounds in young leaves of Japanese pepper (Xanthoxylum piperitum DC.), J. Agric. Food Chem., 2001, 49, 3, 1353-1357, https://doi.org/10.1021/jf001166m . [all data]

Lota, de Rocca Serra, et al., 2001
Lota, M.-L.; de Rocca Serra, D.; Tomi, F.; Casanova, J., Chemical variability of peel and leaf essential oils of 15 species of mandarins, Biochem. Syst. Ecol., 2001, 29, 1, 77-104, https://doi.org/10.1016/S0305-1978(00)00029-6 . [all data]

Miyazawa, Kurose, et al., 2001
Miyazawa, M.; Kurose, K.; Itoh, A.; Hiraoka, N., Comparison of the essential oils of Glehnia littoralis from Northern and Southern Japan, J. Agric. Food Chem., 2001, 49, 11, 5433-5436, https://doi.org/10.1021/jf010219c . [all data]

Orav, Kailas, et al., 2001
Orav, A.; Kailas, T.; Ivask, K., Volatile constituents of Matricaria recutita L. from Estonia, Proc. Est. Acad. Sci. Chem., 2001, 50, 39-45. [all data]

Orav and Kann, 2001
Orav, A.; Kann, J., Determination of peppermint and orange aroma compounds in food and beverages, Proc. Est. Acad. Sci. Chem., 2001, 50, 4, 217-225. [all data]

Vernin, Lageot, et al., 2001
Vernin, G.; Lageot, C.; Gaydou, E.M.; Parkanyi, C., Analysis of the essential oil of Lippia graveolens HBK from El Salvador, Flavour Fragr. J., 2001, 16, 3, 219-226, https://doi.org/10.1002/ffj.984 . [all data]

Baser, Özek, et al., 2000
Baser, K.H.C.; Özek, T.; Demirci, B.; Kürkcüoglu, M.; Aytac, Z.; Duman, H., Composition of the essential oils of Zosima absinthifolia (Vent.) Link and Ferula elaeochytris Korovin from Turkey, Flavour Fragr. J., 2000, 15, 6, 371-372, https://doi.org/10.1002/1099-1026(200011/12)15:6<371::AID-FFJ919>3.0.CO;2-Z . [all data]

Buttery, Light, et al., 2000
Buttery, R.G.; Light, D.M.; Nam, Y.; Merrill, G.B.; Roitman, J.N., Volatile components of green walnut husks, J. Agric. Food Chem., 2000, 48, 7, 2858-2861, https://doi.org/10.1021/jf000288b . [all data]

Chagonda, Makanda, et al., 2000
Chagonda, L.S.; Makanda, C.; Chalchat, J.-C., The essential oils of wild and cultivated Cymbopogon validus (Stapf) Stapf ex Burtt Davy and Elionurus muticus (Spreng.) Kunth from Zimbabwe, Flavour Fragr. J., 2000, 15, 2, 100-104, https://doi.org/10.1002/(SICI)1099-1026(200003/04)15:2<100::AID-FFJ874>3.0.CO;2-Y . [all data]

Franco and Shibamoto, 2000
Franco, M.R.B.; Shibamoto, T., Volatile composition of some Brazilian fruits: umbu-caja (Spondias citherea), camu-camu (Myrciaria dubia), araca-boi (Eugenia stipitata), and cupuacu (Theobroma grandiflorum), J. Agric. Food Chem., 2000, 48, 4, 1263-1265, https://doi.org/10.1021/jf9900074 . [all data]

Mallavarapu, Rao, et al., 2000
Mallavarapu, G.R.; Rao, L.; Ramesh, S., Volatile constituents of the leaf and fruit oils of Murraya koenigii Spreng., L. Ess. Oil Res., 2000, 12, 6, 766-768, https://doi.org/10.1080/10412905.2000.9712211 . [all data]

Mastelic, Milos, et al., 2000
Mastelic, J.; Milos, M.; Jerkovic, I., Essential oil and glycosidically bound volatiles of Origanum vulgare L. ssp. hirtum (Link) letswaart, Flavour Fragr. J., 2000, 15, 3, 190-194, https://doi.org/10.1002/1099-1026(200005/06)15:3<190::AID-FFJ890>3.0.CO;2-O . [all data]

Tamura, Boonbumrung, et al., 2000
Tamura, H.; Boonbumrung, S.; Yoshizawa, T.; Varanyanond, W., Volatile components of the essential oil in the pulp of four yellow mangoes (Mangifera indica L.) in Thailand, Food Sci. Technol. Res., 2000, 6, 1, 68-73, https://doi.org/10.3136/fstr.6.68 . [all data]

Umano, Hagi, et al., 2000
Umano, K.; Hagi, Y.; Nakahara, K.; Shoji, A.; Shibamoto, T., Volatile chemicals identified in extracts from leaves of Japanese mugwort (Artemisia princeps Pamp.), J. Agric. Food Chem., 2000, 48, 8, 3463-3469, https://doi.org/10.1021/jf0001738 . [all data]

Bicchi, Binello, et al., 1999
Bicchi, C.; Binello, A.; D'Amato, A.; Rubiolo, P., Reliability of Van den Dool retention indices in the analysis of essential oils, J. Chromatogr. Sci., 1999, 37, 8, 288-294, https://doi.org/10.1093/chromsci/37.8.288 . [all data]

Choo, Wong, et al., 1999
Choo, L.-C.; Wong, S.-M.; Liew, K.-Y., Essential oil of nutmeg pericarp, J. Sci. Food Agric., 1999, 79, 13, 1954-1957, https://doi.org/10.1002/(SICI)1097-0010(199910)79:13<1954::AID-JSFA460>3.0.CO;2-I . [all data]

Dunlop, Bignell, et al., 1999
Dunlop, P.J.; Bignell, C.M.; Brooker, M.I.H.; Brophy, J.J.; Hibbert, D.B., Use of gas chromatograms of essential leaf oils to compare eight taxa of genus Angophora (Myrtaceae): possible relationships to the genus Eucalyptus, Biochem. Syst. Ecol., 1999, 27, 8, 815-830, https://doi.org/10.1016/S0305-1978(99)00022-8 . [all data]

Kaya, Baser, et al., 1999
Kaya, A.; Baser, K.H.C.; Demirci, B.; Koca, F., The essential oil of Acinos alpinus (L.) Moench growing in Turkey, Flavour Fragr. J., 1999, 14, 1, 55-59, https://doi.org/10.1002/(SICI)1099-1026(199901/02)14:1<55::AID-FFJ784>3.0.CO;2-Q . [all data]

Kaya, Baser, et al., 1999, 2
Kaya, A.; Baser, K.H.C.; Tümen, G.; Koca, F., The essential oil of Acinos suaveolens (Sm.) G. Don fil. Acinos arvensis (Lam.) Dandy and Acinos rotundifolius Pers. growing wild in Turkey, Flavour Fragr. J., 1999, 14, 1, 60-64, https://doi.org/10.1002/(SICI)1099-1026(199901/02)14:1<60::AID-FFJ785>3.0.CO;2-0 . [all data]

Labuckas, Zygadlo, et al., 1999
Labuckas, D.O.; Zygadlo, J.A.; Faillaci, S.M.; Espinar, L.A., Constituents of the volatile oil of Porophyllum obscurum (Spreng.) D.C., Flavour Fragr. J., 1999, 14, 2, 107-108, https://doi.org/10.1002/(SICI)1099-1026(199903/04)14:2<107::AID-FFJ799>3.0.CO;2-E . [all data]

Menon, Chacko, et al., 1999
Menon, A.N.; Chacko, S.; Narayanan, C.S., Free and glycosidically bound volatiles of cardamom (Eletteria cardamomum Maton var. miniscula Burkill), Flavour Fragr. J., 1999, 14, 1, 65-68, https://doi.org/10.1002/(SICI)1099-1026(199901/02)14:1<65::AID-FFJ789>3.0.CO;2-A . [all data]

Ngassoum, Yonkeu, et al., 1999
Ngassoum, M.B.; Yonkeu, S.; Jirovetz, L.; Buchbauer, G.; Schmaus, G.; Hammerschmidt, F.-J.H., Chemical composition of essential oils of Lantana camara leaves and flowers from Cameroon and Madagascar, Flavour Fragr. J., 1999, 14, 4, 245-250, https://doi.org/10.1002/(SICI)1099-1026(199907/08)14:4<245::AID-FFJ819>3.0.CO;2-X . [all data]

Onocha, Ekundayo, et al., 1999
Onocha, P.A.; Ekundayo, O.; Oyelola, O.; Laakso, I., Essential oils of Dacryodes edulis (G. Don) H. J. Lam (African pear), Flavour Fragr. J., 1999, 14, 2, 135-139, https://doi.org/10.1002/(SICI)1099-1026(199903/04)14:2<135::AID-FFJ788>3.0.CO;2-L . [all data]

Prikhod'ko, Klyuev, et al., 1999
Prikhod'ko, A.B.; Klyuev, N.A.; Volkovich, S.V.; Emets, T.I.; Petrenko, V.V.; Dolya, E.V., Component composition od the essential oil of Thymus dimorphus, Chem. Nat. Comp., 1999, 35, 1, 46-51, https://doi.org/10.1007/BF02238208 . [all data]

Rao, Bhattacharya, et al., 1999
Rao, B.R.R.; Bhattacharya, A.K.; Mallavarapu, G.R.; Ramesh, S., Volatile constituents of different parts of cornmint (Mentha arvensis L.), Flavour Fragr. J., 1999, 14, 5, 262-264, https://doi.org/10.1002/(SICI)1099-1026(199909/10)14:5<262::AID-FFJ766>3.0.CO;2-6 . [all data]

Bignell, Dunlop, et al., 1998
Bignell, C.M.; Dunlop, P.J.; Brophy, J.J., Volatile leaf oils of some South-Western and Southern Australian species of the genus Eucalyptus (Series 1). Part XIX, Flavour Fragr. J., 1998, 13, 2, 131-139, https://doi.org/10.1002/(SICI)1099-1026(199803/04)13:2<131::AID-FFJ710>3.0.CO;2-X . [all data]

Milso, Mastelic, et al., 1998
Milso, M.; Mastelic, J.; Radonic, A., Free and glycosidically bound volatile compounds from cypress cones (Cupressus Sempervirens L.), Croat. Chem. Acta, 1998, 71, 1, 139-145. [all data]

Molleken U., Sinnwell V., et al., 1998
Molleken U.; Sinnwell V.; Kubeczka K.H., TThe essential oil composition of fruits from Smyrnium perfoliatum, Phytochemistry, 1998, 47, 6, 1079-1083, https://doi.org/10.1016/S0031-9422(98)80076-9 . [all data]

Mölleken, Sinnwell, et al., 1998
Mölleken, U.; Sinnwell, V.; Kubeczka, K.-H., Essential oil composition of Smyrnium olusatrum, Phytochemistry, 1998, 49, 6, 1709-1714, https://doi.org/10.1016/S0031-9422(98)00195-2 . [all data]

Stashenko, Cervantes, et al., 1998
Stashenko, E.E.; Cervantes, M.; Combariza, Y.; Martínez, J.R., HRGC-FID-MSD Analysis of the Secondary Metabolites Obtained by Different Extraction Methods from Lepechinia schiedeana, and Evaluation of its Antioxidant Activity in vitro in 20th International Symposium on Capillary Chromatography, 1998, 1-11. [all data]

Baser, Kirimer, et al., 1997
Baser, K.H.C.; Kirimer, N.; Duman, H., Composition of the essential oil of Micromeria dolichodontha P. H. Davis, Flavour Fragr. J., 1997, 12, 4, 289-291, https://doi.org/10.1002/(SICI)1099-1026(199707)12:4<289::AID-FFJ640>3.0.CO;2-A . [all data]

Bignell, Dunlop, et al., 1997
Bignell, C.M.; Dunlop, P.J.; Brophy, J.J.; Fookes, C.J.R., Volatile leaf oils of some South-Western and Southern Australian species of the genus Eucalyptus (Series I). Part XIV: Subgenus Monocalyptus, Flavour Fragr. J., 1997, 12, 3, 177-183, https://doi.org/10.1002/(SICI)1099-1026(199705)12:3<177::AID-FFJ626>3.0.CO;2-9 . [all data]

Bignell, Dunlop, et al., 1997, 2
Bignell, C.M.; Dunlop, P.J.; Brophy, J.J., Volatile leaf oils of some South-Western and Southern Australian species of the genus Eucalyptus (Series I). Part XV: Subgenus symphyomyrtus, section bisectaria, series levispermae, Flavour Fragr. J., 1997, 12, 3, 185-193, https://doi.org/10.1002/(SICI)1099-1026(199705)12:3<185::AID-FFJ627>3.0.CO;2-B . [all data]

Bignell, Dunlop, et al., 1997, 3
Bignell, C.M.; Dunlop, P.J.; Brophy, J.J., Volatile leaf oils of some South-Western and Southern Australian species of the genus Eucalyptus (Series I). Part XVI: Subgenus symphyomyrtus, section bisectaria, series cneorifoliae, series porantherae and series falcatae, Flavour Fragr. J., 1997, 12, 261-267. [all data]

Bignell, Dunlop, et al., 1997, 4
Bignell, C.M.; Dunlop, P.J.; Brophy, J.J., Volatile leaf oils of some South-Western and Southern Australian species of the genus Eucalyptus (Series I). Part XVII: Subgenus symphyomyrtus (i) section bisectaria, series calycogonae and (ii) section dumaria, series dumosae, series rigentes and series ovulares, Flavour Fragr. J., 1997, 12, 269-275. [all data]

Bignell, Dunlop, et al., 1997, 5
Bignell, C.M.; Dunlop, P.J.; Brophy, J.J., Volatile leaf oils of some Queensland and Norther Australian species of the genus Eucalyptus (Series II) Part II. Subgenera (a) Blakella, (b) Corymbia, (c) Unnamed, (d) Idiogenes, (e) Monocalyptus and (f) Symphyomyrtus, Flavour Fragr. J., 1997, 12, 4, 277-284, https://doi.org/10.1002/(SICI)1099-1026(199707)12:4<277::AID-FFJ642>3.0.CO;2-B . [all data]

Bignell, Dunlop, et al., 1997, 6
Bignell, C.M.; Dunlop, P.J.; Brophy, J.J., Volatile leaf oils of some south-western and southern Australian speices of the genus Eucalyptus (Series I). Part XVIII. A. Subgenus monocalyptus. B. Subgenus Symphyomyrtus: (i) section Guilfoyleanae; (ii) section bisectaria, series accedentes, series occidentales, series levispermae, series loxophlebae, series macrocarpae, series orbifoliae, series calycogonae; (iii) section dumaria, series incrassatae and series ovulares, Flavour Fragr. J., 1997, 12, 423-432. [all data]

Zunino, Novillo-Newton, et al., 1997
Zunino, M.P.; Novillo-Newton, M.; Maestri, D.M.; Zygadlo, J.A., Composition of the essential oil of Baccharis crispa Spreng. and Baccharis salicifolia Pers. grown in Cordoba (Argentina), Flavour Fragr. J., 1997, 12, 6, 405-407, https://doi.org/10.1002/(SICI)1099-1026(199711/12)12:6<405::AID-FFJ667>3.0.CO;2-R . [all data]

Zygadlo, Ariza-Espinar, et al., 1997
Zygadlo, J.A.; Ariza-Espinar, L.; Velasco-Negueruela, A.; Perez-Alonso, M.J., Volatile constituents of Stevia achalensis hieronymus, Flavour Fragr. J., 1997, 12, 4, 297-299, https://doi.org/10.1002/(SICI)1099-1026(199707)12:4<297::AID-FFJ625>3.0.CO;2-2 . [all data]

Brophy, Goldsack, et al., 1996
Brophy, J.J.; Goldsack, R.J.; Bean, A.R.; Forster, P.I.; Fookes, C.J.R., The leaf essential oils of the genus Syncarpia ten. (Myrtaceae), Flavour Fragr. J., 1996, 11, 6, 361-366, https://doi.org/10.1002/(SICI)1099-1026(199611)11:6<361::AID-FFJ591>3.0.CO;2-T . [all data]

Orav, Kailas, et al., 1996
Orav, A.; Kailas, T.; Liiv, M., Analysis of terpenoic composition of conifer needle oils by steam distillation/extraction, gas chromatography and gas chromatography-mass spectrometry, Chromatographia, 1996, 43, 3/4, 215-219, https://doi.org/10.1007/BF02292955 . [all data]

Sagrero-Nieves and Bartley, 1996
Sagrero-Nieves, L.; Bartley, J.P., Volatile components from the leaves of heterotheca inuloides Cass., Flavour Fragr. J., 1996, 11, 1, 49-51, https://doi.org/10.1002/(SICI)1099-1026(199601)11:1<49::AID-FFJ538>3.0.CO;2-J . [all data]

Stashenko, Puertas, et al., 1996
Stashenko, E.E.; Puertas, M.A.; Combariza, M.Y., Volatile secondary metabolites from Spilanthes americana obtained by simultaneous steam distillation--solvent extraction and supercritical fluid extraction, J. Chromatogr. A, 1996, 752, 1-2, 223-232, https://doi.org/10.1016/S0021-9673(96)00480-3 . [all data]

Tirado, Stashenko, et al., 1995
Tirado, C.B.; Stashenko, E.E.; Combariza, M.Y.; Martinez, J.R., Comparative study of Colombian citrus oils by high-resolution gas chromatography and gas chromatography-mass spectrometry, J. Chromatogr. A, 1995, 697, 1-2, 501-513, https://doi.org/10.1016/0021-9673(94)00955-9 . [all data]

Collin, Deslauriers, et al., 1993
Collin, G.J.; Deslauriers, H.; Pageau, N.; Gagnon, M., Essential oil of Tansy (Tanacetum vulgare L.) of Canadian origin, J. Essent. Oil Res., 1993, 5, 6, 629-638, https://doi.org/10.1080/10412905.1993.9698296 . [all data]

Kollmannsberger, Nitz, et al., 1992
Kollmannsberger, H.; Nitz, S.; Drawert, F., UBer die Aromastoffzusammensetzung von Hochdruckextrakten. I. Pfeffer (Piper nigrum, Var. muntok), Z. Lebensm. Unters Forsch., 1992, 194, 6, 545-551, https://doi.org/10.1007/BF01185481 . [all data]

Loughrin, Hamilton-Kemp, et al., 1990
Loughrin, J.H.; Hamilton-Kemp, T.R.; Andersen, R.A.; Hildebrand, D.F., Headspace compounds from flowers of Nicotiana tabacum and related species, J. Agric. Food Chem., 1990, 38, 2, 455-460, https://doi.org/10.1021/jf00092a027 . [all data]

Wyllie, Brophy, et al., 1990
Wyllie, S.G.; Brophy, J.J.; Sarafis, V.; Hobbs, M., Volatile Components of the Fruit of Pistacia Lentiscus, J. Food. Sci., 1990, 55, 5, 1325-1326, https://doi.org/10.1111/j.1365-2621.1990.tb03926.x . [all data]

Brophy, Davies, et al., 1989
Brophy, J.J.; Davies, N.W.; Southwell, I.A.; Stiff, I.A.; Williams, L.R., Gas chromatographic quality control for oil of Melaleuca terpinen-4-ol type (Australian tea tree), J. Agric. Food Chem., 1989, 37, 5, 1330-1335, https://doi.org/10.1021/jf00089a027 . [all data]

Shibamoto, 1987
Shibamoto, T., Retention Indices in Essential Oil Analysis in Capillary Gas Chromatography in Essential Oil Analysis, Sandra, P.; Bicchi, C., ed(s)., Hutchig Verlag, Heidelberg, New York, 1987, 259-274. [all data]

Nykanen, 1986
Nykanen, I., High Resolution Gas Chromatographic - Mass Spectrometric determination of the Flavour Composition of Wild Majoram (Origanum vulgare L.) Cultivated in Finland, Z. Lebensm Unters Forsch, 1986, 183, 4, 267-272, https://doi.org/10.1007/BF01087742 . [all data]

MacLeod and Snyder, 1985
MacLeod, A.J.; Snyder, C.H., Volatile components of two cultivars of mango from Florida, J. Agric. Food Chem., 1985, 33, 3, 380-384, https://doi.org/10.1021/jf00063a015 . [all data]

Shibamoto and Jennings, 1977
Shibamoto, T.; Jennings, W.G., The volatile composition of the leaf oil of California Juniper (J. californica Carr.) in Proceedings of VII International Congress of Essential Oils, October 7-11, 1977, Kyoto, Japan, 1977, 413-418. [all data]

Stancher and Pertoldi, 1967
Stancher, B.; Pertoldi, M.G., Characterization of commercial materials used in synthetic essential oil production. Identification and gas-chromatographic determination of impurities, Rassegna chimica, 1967, 19, 3, 99-109. [all data]