ethane, 1-chloro-1,2-difluoro-

Phase change data

Data compiled by: Thermodynamics Research Center, NIST Boulder Laboratories, Chris Muzny director

Quantity Value Units Method Reference Comment
Tboil308.2KN/ARausch, Davis, et al., 1963Uncertainty assigned by TRC = 1. K

In addition to the Thermodynamics Research Center (TRC) data available from this site, much more physical and chemical property data is available from the following TRC products:

References

Rausch, Davis, et al., 1963
Rausch, D.A.; Davis, R.A.; Osborne, D.W., The Addition of Fluorine to Halogenated Olefins by Means of Metal Fluorides, J. Org. Chem., 1963, 28, 494. [all data]