Tetrahydrorhombifoline

Normal alkane RI, non-polar column, temperature ramp

View large format table.

Column type Active phase I Reference Comment
CapillaryDB-52050.Przybylak, Ciesiolka, et al., 2005He, 180. C @ 2. min, 5. K/min, 300. C @ 10. min; Column length: 30. m; Column diameter: 0.25 mm
CapillaryDB-12080.Torres, Quintos, et al., 200230. m/0.25 mm/0.25 μm, He, 120. C @ 3. min, 10. K/min, 260. C @ 10. min
CapillaryDB-12050.Greinwald, Henrichs, et al., 1995He, 6. K/min; Column length: 30. m; Column diameter: 0.32 mm; Tstart: 150. C; Tend: 300. C
CapillaryDB-12040.Greinwald, Canto, et al., 1992He, 6. K/min; Column length: 30. m; Column diameter: 0.32 mm; Tstart: 150. C; Tend: 300. C
CapillarySE-302050.Wink, Witte, et al., 1983He, 6. K/min; Column length: 15. m; Column diameter: 0.26 mm; Tstart: 150. C; Tend: 270. C

Normal alkane RI, non-polar column, custom temperature program

View large format table.

Column type Active phase I Reference Comment
CapillaryDB-12050.El-Shazly, Ateya, et al., 2001Helium; Column length: 15. m; Column diameter: 0.317 mm; Program: 150 0C (2 min) 15 0C/min -> 250 0C 25 0C/min -> 300 0C (5 min)
CapillaryDB-12050.Greinwald, van Rensen, et al., 1995He; Column length: 30. m; Column diameter: 0.32 mm; Program: 150C (2min) => 10C/min => 250C => 20C/min => 300C (5min)
CapillaryDB-12050.Wink, Meissner, et al., 1995Column length: 30. m; Column diameter: 0.3 mm; Program: not specified

References

Przybylak, Ciesiolka, et al., 2005
Przybylak, J.K.; Ciesiolka, D.; Wysocka, W.; García-López, P.M.; Ruiz-López, M.A.; Wysocki, W.; Gulewicz, K., Alkaloid profiles of Mexican wild lupin and an effect of alkaloid preparation from Lupinus exaltatus seeds on growth and yield of paprika (Capsicum annuum L.), Ind. Crops Prod., 2005, 21, 1, 1-7, https://doi.org/10.1016/j.indcrop.2003.12.001 . [all data]

Torres, Quintos, et al., 2002
Torres, K.B.; Quintos, N.R.; Necha, L.L.B.; Wink, M., Alkaloid profile of leaves and seeds of Lupinus hintonii C.P. Smith, Z. Naturforsch., 2002, 57c, 243-247. [all data]

Greinwald, Henrichs, et al., 1995
Greinwald, R.; Henrichs, C.; Veen, G.; Ross, J.H.; Witte, L.; Czygan, F.-C., A survey of alkaloids in templetonia biloba (Benth.) Polhill (Fabaceae: Brongniartieae), Biochem. Syst. Ecol., 1995, 23, 6, 649-654, https://doi.org/10.1016/0305-1978(95)00035-6 . [all data]

Greinwald, Canto, et al., 1992
Greinwald, R.; Canto, P.; Bachmann, P.; Witte, L.; Czygan, F.-C., Distribution and taxdonomic significance of alkaloids in the Genista cinerea agregat, Biochem. Syst. Ecol., 1992, 20, 1, 75-81, https://doi.org/10.1016/0305-1978(92)90074-N . [all data]

Wink, Witte, et al., 1983
Wink, M.; Witte, L.; Hartmann, T.; Theuring, C.; Volz. V., Accumulation of quinolizidine alkaloids in plants and cell suspension cultures: genera lupinus, cytisus, baptisia, genista, laburnum, and sophora, Planta Medica, 1983, 48, 4, 253-257, https://doi.org/10.1055/s-2007-969928 . [all data]

El-Shazly, Ateya, et al., 2001
El-Shazly, A.; Ateya, A.-M.M.; Wink, M., Quinolizidine alkaloid profiles of lupunus varius orientalis. L. albus albus, L. hartwegii, and L. densiflorus, Z. Naturforsch., 2001, 56c, 21-30. [all data]

Greinwald, van Rensen, et al., 1995
Greinwald, R.; van Rensen, I.; Veit, M.; Canto, P.; Witte, L., A chemical dichotomy in quinolizidine alkaloid accumulation within the section Spartioides of the genus Genista (Fabaceae: Genisteae), Biochem. Syst. Ecol., 1995, 23, 1, 89-97, https://doi.org/10.1016/0305-1978(95)93662-M . [all data]

Wink, Meissner, et al., 1995
Wink, M.; Meissner, C.; Witte, L., Patterns of quinolizidine alkaloids in 56 species of the genus Lupinus, Phytochemistry, 1995, 38, 1, 139-153, https://doi.org/10.1016/0031-9422(95)91890-D . [all data]