Triclosan

Normal alkane RI, non-polar column, temperature ramp

View large format table.

Column type Active phase I Reference Comment
CapillaryDB-52114.Grung, Lichtenthaler, et al., 200730. m/0.25 mm/0.25 μm, 5. K/min, 280. C @ 10. min; Tstart: 40. C

References

Grung, Lichtenthaler, et al., 2007
Grung, M.; Lichtenthaler, R.; Ahel, M.; Tollefsen, K.-E.; Langford, K.; Thomas, K.V., Effects-directed analysis of organic toxicants in wastewater effluent from Zagreb, Croatia, Chemosphere, 2007, 67, 1, 108-120, https://doi.org/10.1016/j.chemosphere.2006.09.021 . [all data]