Benzaldehyde, O-methyloxime

Gas phase ion energetics data

Data compiled by: Sharon G. Lias, Rhoda D. Levin, and Sherif A. Kafafi

Ionization energy determinations

IE (eV) Method Reference
8.76 ± 0.05EIThorstad, Undheim, et al., 1975

Van Den Dool and Kratz RI, non-polar column, temperature ramp

View large format table.

Column type Active phase I Reference Comment
PackedOV-11071.Mattsson and Petersson, 1977N2, Supelcoport, 4. K/min; Column length: 2. m; Tstart: 80. C; Tend: 240. C

References

Thorstad, Undheim, et al., 1975
Thorstad, O.; Undheim, K.; El-Gendy, M.A.F., Ionisation potentials in structure analysis of isomeric nitrones, oxaziranes, O-ether oximes acid amides, Org. Mass Spectrom., 1975, 10, 1155. [all data]

Mattsson and Petersson, 1977
Mattsson, M.; Petersson, G., Reference GLC Data for the Analysis of Phenolic Compounds as Trimethylsilyl Derivatives, J. Chromatogr. Sci., 1977, 15, 12, 546-554, https://doi.org/10.1093/chromsci/15.12.546 . [all data]