2-Propanamine, 2-methyl-N-(phenylmethylene)-, N-oxide

Gas phase thermochemistry data

Data compiled by: Hussein Y. Afeefy, Joel F. Liebman, and Stephen E. Stein

Quantity Value Units Method Reference Comment
Δfgas30.9 ± 2.0kJ/molCcbAcree, Kirchner, et al., 1989

Condensed phase thermochemistry data

Data compiled by: Hussein Y. Afeefy, Joel F. Liebman, and Stephen E. Stein

Quantity Value Units Method Reference Comment
Δfsolid-55.9 ± 1.8kJ/molCcbAcree, Kirchner, et al., 1989
Quantity Value Units Method Reference Comment
Δcsolid-6416.4 ± 1.1kJ/molCcbAcree, Kirchner, et al., 1989

Phase change data

Data compiled as indicated in comments:
ALS - Hussein Y. Afeefy, Joel F. Liebman, and Stephen E. Stein
AC - William E. Acree, Jr., James S. Chickos

Quantity Value Units Method Reference Comment
Δsub86.8 ± 0.9kJ/molCAcree, Kirchner, et al., 1989ALS
Δsub86.8 ± 0.9kJ/molCAcree, Kirchner, et al., 1989AC

Gas phase ion energetics data

Data compiled by: Sharon G. Lias, Rhoda D. Levin, and Sherif A. Kafafi

Ionization energy determinations

IE (eV) Method Reference Comment
7.69PEHouk, Caramella, et al., 1977Vertical value

References

Acree, Kirchner, et al., 1989
Acree, W.E., Jr.; Kirchner, J.J.; Tucker, S.A., Enthalpies of combustion of three benzylidene t-butylamine N-oxide derivatives and of 4-nitrobenxylidene t-butylamine: the dissociation enthalpies of the (N-O) bonds, J. Chem. Thermodyn., 1989, 21, 443-448. [all data]

Houk, Caramella, et al., 1977
Houk, K.N.; Caramella, P.; Munchausen, L.L.; Chang, Y.-M.; Battaglia, A.; Sims, J.; Kaufman, D.C., Photoelectron spectra of nitrones and nitrile oxides, J. Electron Spectrosc. Relat. Phenom., 1977, 10, 441. [all data]