Methanamine, N-(phenylmethylene)-, N-oxide

Gas phase ion energetics data

Data compiled as indicated in comments:
LLK - Sharon G. Lias, Rhoda D. Levin, and Sherif A. Kafafi

Ionization energy determinations

IE (eV) Method Reference Comment
8.01PEHouk, Bimanand, et al., 1977LLK
8.08 ± 0.05EIThorstad, Undheim, et al., 1975LLK
8.01PEArmen, Braunstein, et al., 1979Vertical value; LLK
7.89PEHouk, Caramella, et al., 1977Vertical value; LLK
8.01 ± 0.02PEBastide, Maier, et al., 1976Vertical value; LLK

References

Houk, Bimanand, et al., 1977
Houk, K.N.; Bimanand, A.; Mukherjee, D.; Sims, J.; Chang, Y.-M.; Kaufman, D.C.; Domelsmith, L.N., Nitrone ionization potentials and cycloaddition regioselectivities, J. Heterocycl. Chem., 1977, 7, 293. [all data]

Thorstad, Undheim, et al., 1975
Thorstad, O.; Undheim, K.; El-Gendy, M.A.F., Ionisation potentials in structure analysis of isomeric nitrones, oxaziranes, O-ether oximes acid amides, Org. Mass Spectrom., 1975, 10, 1155. [all data]

Armen, Braunstein, et al., 1979
Armen, G.H.; Braunstein, C.; Weinstein, M.I.; Baker, A.D., Reaction of azoxyanisole with oxalyl chloride: Use of photoelectron spectroscopy in seeking new reactions, Tetrahedron Lett., 1979, 43, 4197. [all data]

Houk, Caramella, et al., 1977
Houk, K.N.; Caramella, P.; Munchausen, L.L.; Chang, Y.-M.; Battaglia, A.; Sims, J.; Kaufman, D.C., Photoelectron spectra of nitrones and nitrile oxides, J. Electron Spectrosc. Relat. Phenom., 1977, 10, 441. [all data]

Bastide, Maier, et al., 1976
Bastide, J.; Maier, J.P.; Kubota, T., Ionisation energies and electronic structures of the phenyl 1,3-dipoles, J. Electron Spectrosc. Relat. Phenom., 1976, 9, 307. [all data]