Thallium octadecanoate

Phase change data

Data compiled by: Eugene S. Domalski and Elizabeth D. Hearing

Enthalpy of phase transition

ΔHtrs (kJ/mol) Temperature (K) Initial Phase Final Phase Reference Comment
9.623324.crystaline, IIIcrystaline, IIMeisel, Seybold, et al., 1976
12.134380.crystaline, IIcrystaline, IMeisel, Seybold, et al., 1976
5.439385.crystaline, IliquidMeisel, Seybold, et al., 1976
1.381444.liquidliquidMeisel, Seybold, et al., 1976

Entropy of phase transition

ΔStrs (J/mol*K) Temperature (K) Initial Phase Final Phase Reference Comment
29.3324.crystaline, IIIcrystaline, IIMeisel, Seybold, et al., 1976
12.1380.crystaline, IIcrystaline, IMeisel, Seybold, et al., 1976
14.2385.crystaline, IliquidMeisel, Seybold, et al., 1976
3.05444.liquid, Mesophaseliquid, isotropicMeisel, Seybold, et al., 1976

References

Meisel, Seybold, et al., 1976
Meisel, T.; Seybold, K.; Halmos, Z.; Roth, J.; Melykuti, C., Thermal behavior of thallium(I) fatty acid salts. I, J. Therm. Anal., 1976, 10, 419-431. [all data]