Hexanedioic acid, diisononyl ester

Van Den Dool and Kratz RI, non-polar column, temperature ramp

Data compiled by: NIST Mass Spectrometry Data Center, William E. Wallace, director

Column type Capillary
Active phase 5 % Phenyl methyl siloxane
Column length (m) 30.
Carrier gas
Substrate
Column diameter (mm) 0.25
Phase thickness (μm) 0.5
Tstart (C) 50.
Tend (C) 300.
Heat rate (K/min) 8.
Initial hold (min) 1.
Final hold (min) 10.
I 2680.
ReferenceGuisto, Smith, et al., 1993
Comment MSDC-RI

References

Guisto, Smith, et al., 1993
Guisto, R.; Smith, S.R.; Stuart, J.D., Gas chromatographic retention indices, mass, and infrared spectra of industrially important adipate esters, J. Chromatogr. Sci., 1993, 31, 6, 225-230, https://doi.org/10.1093/chromsci/31.6.225 . [all data]