2(3H)-Thiophenone,3,3-dimethyl-

Gas phase ion energetics data

Data compiled by: Sharon G. Lias, Rhoda D. Levin, and Sherif A. Kafafi

Ionization energy determinations

IE (eV) Method Reference
8.77 ± 0.05EIThorstad, Undheim, et al., 1975

References

Thorstad, Undheim, et al., 1975
Thorstad, O.; Undheim, K.; Cederlund, B.; Hornfeldt, A.-B., Ionisation potentials in tautomeric analysis of 2-hydroxy derivatives of thiophenes, selenophenes, and furans, Acta Chem. Scand. Ser. B:, 1975, 29, 647. [all data]