Benzene, 1-cyclobuten-1-yl-

Reaction thermochemistry data

Data compiled by: John E. Bartmess

Individual Reactions

C10H9- + Hydrogen cation = Benzene, 1-cyclobuten-1-yl-

By formula: C10H9- + H+ = C10H10

Quantity Value Units Method Reference Comment
Δr1579.4 ± 3.2kJ/molG+TSGlasovac, Eckert-Maksic, et al., 2002gas phase
Quantity Value Units Method Reference Comment
Δr1546.0 ± 2.9kJ/molIMREGlasovac, Eckert-Maksic, et al., 2002gas phase

Gas phase ion energetics data

Data compiled as indicated in comments:
B - John E. Bartmess
LBLHLM - Sharon G. Lias, John E. Bartmess, Joel F. Liebman, John L. Holmes, Rhoda D. Levin, and W. Gary Mallard
LLK - Sharon G. Lias, Rhoda D. Levin, and Sherif A. Kafafi

Ionization energy determinations

IE (eV) Method Reference Comment
8.24EIDass and Gross, 1983LBLHLM
8.20 ± 0.05EIDerocque and Jochem, 1975LLK
8.22PEBruckmann and Klessinger, 1974LLK

De-protonation reactions

C10H9- + Hydrogen cation = Benzene, 1-cyclobuten-1-yl-

By formula: C10H9- + H+ = C10H10

Quantity Value Units Method Reference Comment
Δr1579.4 ± 3.2kJ/molG+TSGlasovac, Eckert-Maksic, et al., 2002gas phase; B
Quantity Value Units Method Reference Comment
Δr1546.0 ± 2.9kJ/molIMREGlasovac, Eckert-Maksic, et al., 2002gas phase; B

References

Glasovac, Eckert-Maksic, et al., 2002
Glasovac, Z.; Eckert-Maksic, M.; Dacres, J.E.; Kass, S.R., Gas phase formation of 1-phenylcyclobuten-3-yl and 1- phenylallyl anions and a determination of the allylic C-H acidities and bond dissociation energies of 1-phenylcyclobutene and (E)-1-phen, J. Chem. Soc. Perkin Trans., 2002, 2, 3, 410-415, https://doi.org/10.1039/b111398d . [all data]

Dass and Gross, 1983
Dass, C.; Gross, M.L., Electrocyclic ring opening of 1-phenylcyclobutene and 3-phenylcyclobutene radical cations, J. Am. Chem. Soc., 1983, 105, 5724. [all data]

Derocque and Jochem, 1975
Derocque, J.-L.; Jochem, M., Studies in mass spectrometry. III. Formation of a common intermediate in the primary fragmentation process of 1-phenylcyclobutene and of 2-phenyl-1,3-butadiene, Org. Mass Spectrom., 1975, 10, 935. [all data]

Bruckmann and Klessinger, 1974
Bruckmann, P.; Klessinger, M., Photoelektronenspektren organischer verbindungen. V. Wechselwirkung kleiner ringe mit π-systemen, Chem. Ber., 1974, 107, 1108. [all data]