Mercuric chloride

Gas phase ion energetics data

Data compiled by: Sharon G. Lias, John E. Bartmess, Joel F. Liebman, John L. Holmes, Rhoda D. Levin, and W. Gary Mallard

Ionization energy determinations

IE (eV) Method Reference Comment
9.82 ± 0.05PEBaidin, Timoshenko, et al., 1985Vertical value

References

Baidin, Timoshenko, et al., 1985
Baidin, V.N.; Timoshenko, M.M.; Chizhov, Y.V.; Ustynyuk, Y.A.; Kritskaya, I.I., Photoelectron spectra nad the structure of organomercury compounds, J. Organomet. Chem., 1985, 292, 55. [all data]