Methanone, phenyl[2,4,6-tris(methylethyl)phenyl]-

Gas phase thermochemistry data

Data compiled by: Hussein Y. Afeefy, Joel F. Liebman, and Stephen E. Stein

Quantity Value Units Method Reference Comment
Δfgas-45. ± 2.kcal/molCcbInagaki, Murata, et al., 1982

References

Inagaki, Murata, et al., 1982
Inagaki, S.; Murata, S.; Sakiyama, M.; Ito, Y.; Umihara, Y.; Hijiya, T.; Matsura, T., Bull. Chem. Soc. Jpn., 1982, 55, 2803. [all data]