p-Benzyne

Gas phase thermochemistry data

Data compiled by: Hussein Y. Afeefy, Joel F. Liebman, and Stephen E. Stein

Quantity Value Units Method Reference Comment
Δfgas128. ± 3.kcal/molIonWenthold, Paulino, et al., 1991collision-induced dissociation

References

Wenthold, Paulino, et al., 1991
Wenthold, P.G.; Paulino, J.A.; Squires, R.R., The absolute heats of formation of o-,m-, and p-benzyne, J. Am. Chem. Soc., 1991, 113, 7414-7415. [all data]