2-Butyne, 1-chloro-

Normal alkane RI, non-polar column, temperature ramp

View large format table.

Column type Active phase I Reference Comment
CapillaryOV-101723.Zenkevich, 200525. m/0.20 mm/0.10 μm, N2/He, 6. K/min; Tstart: 50. C; Tend: 250. C

References

Zenkevich, 2005
Zenkevich, I.G., Experimentally measured retention indices., 2005. [all data]