Butane, 2,2,3-trichloro-1,1,1,3,4,4,4-heptafluoro-

Phase change data

Data compiled as indicated in comments:
BS - Robert L. Brown and Stephen E. Stein
TRC - Thermodynamics Research Center, NIST Boulder Laboratories, Chris Muzny director
AC - William E. Acree, Jr., James S. Chickos

Quantity Value Units Method Reference Comment
Tboil371.KN/APCR Inc., 1990BS
Tboil371.2KN/AWeast and Grasselli, 1989BS
Tboil370.55KN/AYen and Reed, 1959Uncertainty assigned by TRC = 0.5 K; TRC
Quantity Value Units Method Reference Comment
Δvap8.51kcal/molN/AYen and Reed, 1959, 2AC

Enthalpy of vaporization

ΔvapH (kcal/mol) Temperature (K) Method Reference Comment
8.70317.MM,AStephenson and Malanowski, 1987Based on data from 302. - 446. K. See also Capps and Jackson, 1956.; AC

In addition to the Thermodynamics Research Center (TRC) data available from this site, much more physical and chemical property data is available from the following TRC products:

References

PCR Inc., 1990
PCR Inc., Research Chemicals Catalog 1990-1991, PCR Inc., Gainesville, FL, 1990, 1. [all data]

Weast and Grasselli, 1989
CRC Handbook of Data on Organic Compounds, 2nd Editon, Weast,R.C and Grasselli, J.G., ed(s)., CRC Press, Inc., Boca Raton, FL, 1989, 1. [all data]

Yen and Reed, 1959
Yen, L.C.; Reed, T.M., Vapor-Liquid Equilibria in Binary Systems Containing Fluorocarbons and Chlorofluorocarbons, J. Chem. Eng. Data, 1959, 4, 102. [all data]

Yen and Reed, 1959, 2
Yen, L.C.; Reed, T.M., Vapor-Liquid Equilibria in Binary Systems Containing Fluorocarbons and Chlorofluorocarbons., J. Chem. Eng. Data, 1959, 4, 2, 102-107, https://doi.org/10.1021/je60002a002 . [all data]

Stephenson and Malanowski, 1987
Stephenson, Richard M.; Malanowski, Stanislaw, Handbook of the Thermodynamics of Organic Compounds, 1987, https://doi.org/10.1007/978-94-009-3173-2 . [all data]

Capps and Jackson, 1956
Capps, R.H.; Jackson, W. Morrison, Density, Vapor Pressure And Heat Of Vaporization Of 2,2,3-Trichloro-Heptafluorobutane, J. Phys. Chem., 1956, 60, 6, 811-812, https://doi.org/10.1021/j150540a034 . [all data]