Pyrene, 4-methyl-

Phase change data

Data compiled by: Thermodynamics Research Center, NIST Boulder Laboratories, Chris Muzny director

Quantity Value Units Method Reference Comment
Tfus416.KN/AVollman, Becker, et al., 1937Uncertainty assigned by TRC = 3. K

In addition to the Thermodynamics Research Center (TRC) data available from this site, much more physical and chemical property data is available from the following TRC products:

Lee's RI, non-polar column, custom temperature program

Data compiled by: NIST Mass Spectrometry Data Center, William E. Wallace, director

Column type CapillaryCapillaryCapillaryCapillaryCapillary
Active phase HP-5MSHP-5MSHP-5MSHP-5MSUltra-1
Column length (m) 30.30.30.30.50.
Carrier gas HeHeHeHeNitrogen
Substrate
Column diameter (mm) 0.250.250.250.250.32
Phase thickness (μm) 0.250.250.250.250.50
Program 60C(2min) => 6C/min => 258C => 2C/min => 300C(4min)not specifiednot specifiednot specified40-100 0C 3-15 0C/min -> 290 0C
I 368.75368.75369.05369.54369.5
ReferenceWang, Li, et al., 2007Wang, Li, et al., 2007, 2Wang, Li, et al., 2007, 2Wang, Li, et al., 2007, 2Sremac, Skrbic, et al., 2005
Comment MSDC-RI MSDC-RI MSDC-RI MSDC-RI MSDC-RI
Column type CapillaryCapillary
Active phase SE-52SE-52
Column length (m) 30.
Carrier gas
Substrate
Column diameter (mm) 0.30
Phase thickness (μm)
Program not specifiednot specified
I 369.54369.54
ReferenceWang, Peng, et al., 1997Shlyakhov, 1984
Comment MSDC-RI MSDC-RI

References

Vollman, Becker, et al., 1937
Vollman, H.; Becker, H.; Correll, M.; Streeck, H.; Langbein, G., Pyrene and Its Derivatives, Justus Liebigs Ann. Chem., 1937, 531, 1-159. [all data]