2-Amino-2,4,6-cyclohepta-trien-1-one

Phase change data

Data compiled by: Hussein Y. Afeefy, Joel F. Liebman, and Stephen E. Stein

Enthalpy of sublimation

ΔsubH (kJ/mol) Temperature (K) Method Reference
71.1 ± 0.4297.0 ± 0.5VJackson, Hung, et al., 1971

References

Jackson, Hung, et al., 1971
Jackson, W.; Hung, T.S.; Hopkins, H.P., Jr., Delocalization energies of troponoids from bomb calorimetric and vapour pressure measurements, J. Chem. Thermodyn., 1971, 3, 347-353. [all data]