Pentafluoromethylamine

Reaction thermochemistry data

Data compiled by: Hussein Y. Afeefy, Joel F. Liebman, and Stephen E. Stein

Individual Reactions

CF5N = Tetrafluoromethane + 0.5Nitrogen + 0.5fluorine

By formula: CF5N = CF4 + 0.5N2 + 0.5F2

Quantity Value Units Method Reference Comment
Δr-226. ± 2.kJ/molCcbWalker, 1972gas phase; Decompostion reaction

Tetrafluoromethane + 0.5Nitrogen + 0.5fluorine = CF5N

By formula: CF4 + 0.5N2 + 0.5F2 = CF5N

Quantity Value Units Method Reference Comment
Δr226. ± 2.kJ/molCcbWalker, 1972gas phase; Decompostion reaction

Phase change data

Data compiled by: William E. Acree, Jr., James S. Chickos

Enthalpy of sublimation

ΔsubH (kcal/mol) Temperature (K) Reference Comment
4.45135.Stephenson and Malanowski, 1987Based on data from 128. - 141. K. See also Fahim, Fleifel, et al., 1951.

References

Walker, 1972
Walker, L.C., The enthalpy of decomposition of CF3NF2(g) to CF4(g), N2(g), and F2(g), J. Chem. Thermodyn., 1972, 4, 219-223. [all data]