2-Hepten-1-ol, (E)-

Normal alkane RI, polar column, temperature ramp

Data compiled by: NIST Mass Spectrometry Data Center, William E. Wallace, director

Column type CapillaryCapillaryCapillaryCapillary
Active phase DB-WaxDB-WaxDB-WaxTC-Wax
Column length (m) 30.30.30.60.
Carrier gas HeliumHeliumHe
Substrate
Column diameter (mm) 0.250.250.250.25
Phase thickness (μm) 0.250.250.25
Tstart (C) 60.60.50.80.
Tend (C) 200.200.220.240.
Heat rate (K/min) 8.8.4.3.
Initial hold (min) 3.3.3.5.
Final hold (min) 9.59.5
I 1504.1536.1517.1507.
ReferenceRochat, Egger, et al., 2009Rochat, Egger, et al., 2009Weckerle, Bastl-Borrmann, et al., 2001Shuichi, Masazumi, et al., 1996
Comment MSDC-RI MSDC-RI MSDC-RI MSDC-RI

Normal alkane RI, polar column, custom temperature program

Data compiled by: NIST Mass Spectrometry Data Center, William E. Wallace, director

Column type Capillary
Active phase DB-Wax
Column length (m) 30.
Carrier gas Helium
Substrate
Column diameter (mm) 0.25
Phase thickness (μm) 0.25
Program not specified
I 1517.
ReferenceRochat, Egger, et al., 2009
Comment MSDC-RI

References

Rochat, Egger, et al., 2009
Rochat, S.; Egger, J.; Chaintreau, A., Strategy for the identification of key odorants: application to shrimp aroma, J. Chromatogr. A, 2009, 1216, 36, 6424-6432, https://doi.org/10.1016/j.chroma.2009.07.014 . [all data]

Weckerle, Bastl-Borrmann, et al., 2001
Weckerle, B.; Bastl-Borrmann, R.; Richling, E.; Hör, K.; Ruff, C.; Schreier, P., Cactus pear (Opuntia ficus indica) flavour constituents - chiral evaluation (MDGC-MS) and isotope ratio (HRGC-IRMS) analysis, Flavour Fragr. J., 2001, 16, 5, 360-363, https://doi.org/10.1002/ffj.1012 . [all data]

Shuichi, Masazumi, et al., 1996
Shuichi, H.; Masazumi, N.; Hiromu, K.; Kiyoshi, F., Comparison of volatile compounds berween the crude drugs, Onji-tsutsu and Onji-niki, Nippon nogei kagaku kaishi, 1996, 70, 2, 151-160. [all data]