Tricyclo[8.2.2.24,7]hexadeca-4,6,10,12,13,15-hexaene,2,2,3,3,8,8,9,9,-octafluoro-

Gas phase ion energetics data

Data compiled by: Sharon G. Lias, Rhoda D. Levin, and Sherif A. Kafafi

Ionization energy determinations

IE (eV) Method Reference
8.90PEHeilbronner and Maier, 1974

References

Heilbronner and Maier, 1974
Heilbronner, E.; Maier, J.P., Consequences of substitution in the photoelectron spectra of [2,2] paracyclophanes: separation of 'through-space' and 'through-bond' interactions as a consequence of fluorosubstitution, Helv. Chim. Acta, 1974, 57, 151. [all data]