Hydrogen sulfide dimer

Gas phase ion energetics data

Data compiled by: Sharon G. Lias, John E. Bartmess, Joel F. Liebman, John L. Holmes, Rhoda D. Levin, and W. Gary Mallard

Appearance energy determinations

Ion AE (eV) Other Products MethodReferenceComment
H3S+10.263 ± 0.010HSPIWalters and Blais, 1984

References

Walters and Blais, 1984
Walters, E.A.; Blais, N.C., Molecular beam photoionization and fragmentation of D2S, (H2S)2, (D2S)2, and H2S.H2O, J. Chem. Phys., 1984, 80, 3501. [all data]