Nickel anion

Reaction thermochemistry data

Data compiled by: John E. Bartmess

Individual Reactions

Ni- + Hydrogen cation = HNi

By formula: Ni- + H+ = HNi

Quantity Value Units Method Reference Comment
Δr1452. ± 7.9kJ/molD-EAScheer, Brodie, et al., 1998gas phase

References

Scheer, Brodie, et al., 1998
Scheer, M.; Brodie, C.A.; Bilodeau, R.C.; Haugen, H.K., Laser spectroscopic measurements of binding energies and fine-structure splittings of Co-, Ni-, Rh-, and Pd-, Phys. Rev. A, 1998, 58, 3, 2051-2062, https://doi.org/10.1103/PhysRevA.58.2051 . [all data]