Rhenium, tetracarbonyl[(1,2,3-η3)-2-methyl-2-propenyl]-

Gas phase ion energetics data

Data compiled by: Sharon G. Lias, John E. Bartmess, Joel F. Liebman, John L. Holmes, Rhoda D. Levin, and W. Gary Mallard

Ionization energy determinations

IE (eV) Method Reference Comment
8.0PEBohm, Gleiter, et al., 1983
8.31PEBohm, Gleiter, et al., 1983Vertical value

References

Bohm, Gleiter, et al., 1983
Bohm, M.C.; Gleiter, R.; Albright, T.A.; Sriyunyongwat, V., The low-lying cationic hole-states of η3-allyl tetracarbonyl complexes of Mn and Re. Photoelectron spectra and Green's Function Calculations, Mol. Phys., 1983, 50, 113. [all data]