Propane, 1,1,1,2,3,3-hexafluoro-2-(heptafluoropropoxy)-3-[1,2,2-trifluoro-2-(1,2,2,2-tetrafluoroethoxy)-1-(trifluoromethyl)ethoxy]-

Phase change data

Data compiled by: Robert L. Brown and Stephen E. Stein

Quantity Value Units Method Reference Comment
Tboil424. - 427.KN/APCR Inc., 1990

Gas phase ion energetics data

Data compiled by: Sharon G. Lias, Rhoda D. Levin, and Sherif A. Kafafi

Ionization energy determinations

IE (eV) Method Reference Comment
12.96PEHardin and Sandorfy, 1975Vertical value

References

PCR Inc., 1990
PCR Inc., Research Chemicals Catalog 1990-1991, PCR Inc., Gainesville, FL, 1990, 1. [all data]

Hardin and Sandorfy, 1975
Hardin, A.H.; Sandorfy, C., Photoelectron and vacuum ultraviolet spectra of a series of fluoroethers, J. Fluorine Chem., 1975, 5, 435. [all data]