Furan, 2,5-dihydro-2,5-dimethoxy-

Phase change data

Data compiled as indicated in comments:
BS - Robert L. Brown and Stephen E. Stein
AC - William E. Acree, Jr., James S. Chickos

Quantity Value Units Method Reference Comment
Tboil434.2KN/AWeast and Grasselli, 1989BS
Quantity Value Units Method Reference Comment
Δvap44.2 ± 0.3kJ/molCGCNichols, Orf, et al., 2000AC

Reaction thermochemistry data

Data compiled by: Hussein Y. Afeefy, Joel F. Liebman, and Stephen E. Stein

Individual Reactions

Hydrogen + Furan, 2,5-dihydro-2,5-dimethoxy- = Furan, tetrahydro-2,5-dimethoxy-

By formula: H2 + C6H10O3 = C6H12O3

Quantity Value Units Method Reference Comment
Δr-131.1 ± 0.59kJ/molChydAllinger, Glaser, et al., 1981liquid phase; solvent: Hexane

References

Weast and Grasselli, 1989
CRC Handbook of Data on Organic Compounds, 2nd Editon, Weast,R.C and Grasselli, J.G., ed(s)., CRC Press, Inc., Boca Raton, FL, 1989, 1. [all data]

Nichols, Orf, et al., 2000
Nichols, Gary; Orf, Jennifer; Reiter, Sarah M.; Chickos, James; Gokel, George W., The vaporization enthalpies of some crown and polyethers by correlation gas chromatography, Thermochimica Acta, 2000, 346, 1-2, 15-28, https://doi.org/10.1016/S0040-6031(99)00405-0 . [all data]

Allinger, Glaser, et al., 1981
Allinger, N.L.; Glaser, J.A.; Davis, H.E., Heats of hydrogenation of some vinyl ethers and related compounds, J. Org. Chem., 1981, 46, 658-661. [all data]