3-Hydroxy-2,3-diphenyl-3-propenal

Condensed phase thermochemistry data

Data compiled by: Hussein Y. Afeefy, Joel F. Liebman, and Stephen E. Stein

Quantity Value Units Method Reference Comment
Δfsolid-56.kcal/molCcbMoureu, 1930
Quantity Value Units Method Reference Comment
Δcsolid-1772.5kcal/molCcbMoureu, 1930Corresponding Δfsolid = -48.2 kcal/mol (simple calculation by NIST; no Washburn corrections)

References

Moureu, 1930
Moureu, M.H., Des sur la tautomerie des dicetones α, Ann. Chem., 1930, 14, 283-405. [all data]