N,N'-dimethylguanidine

Gas phase ion energetics data

Data compiled by: Henry M. Rosenstock, Keith Draxl, Bruce W. Steiner, and John T. Herron

Ionization energy determinations

IE (eV) Method Reference
8.39 ± 0.05EILoudon, Maccoll, et al., 1968

References

Loudon, Maccoll, et al., 1968
Loudon, A.G.; Maccoll, A.; Webb, K.S., Charge location and fragmentation in mass spectrometry. II. The mass spectra and ionization potentials of some methylguanidines, Advan. Mass Spectrom., 1968, 4, 223. [all data]