4-Nitrocatechol

Gas phase thermochemistry data

Data compiled by: Hussein Y. Afeefy, Joel F. Liebman, and Stephen E. Stein

Quantity Value Units Method Reference Comment
Δfgas-290.0 ± 1.8kJ/molCcbRibeiro Da Silva, Ribeiro Da Silva, et al., 1986

Condensed phase thermochemistry data

Data compiled by: Hussein Y. Afeefy, Joel F. Liebman, and Stephen E. Stein

Quantity Value Units Method Reference Comment
Δfsolid-411.1 ± 1.1kJ/molCcbRibeiro Da Silva, Ribeiro Da Silva, et al., 1986
Quantity Value Units Method Reference Comment
Δcsolid-2664.5 ± 0.8kJ/molCcbRibeiro Da Silva, Ribeiro Da Silva, et al., 1986

Phase change data

Data compiled by: Hussein Y. Afeefy, Joel F. Liebman, and Stephen E. Stein

Quantity Value Units Method Reference Comment
Δsub121.1 ± 1.4kJ/molCRibeiro Da Silva, Ribeiro Da Silva, et al., 1986

References

Ribeiro Da Silva, Ribeiro Da Silva, et al., 1986
Ribeiro Da Silva, M.D.M.C.; Ribeiro Da Silva, M.A.V.; Pilcher, G., Enthalpies of combustion of the three trihydroxybenzenes and of 3-methoxycatechol and 4-nitrocatechol, J. Chem. Thermodyn., 1986, 18, 295-300. [all data]