β,β-Diethylstyrene

Condensed phase thermochemistry data

Data compiled by: Hussein Y. Afeefy, Joel F. Liebman, and Stephen E. Stein

Quantity Value Units Method Reference Comment
Δcliquid-6976.4kJ/molCcbAuwsers, Roth, et al., 1910Corresponding Δfliquid = -32. kJ/mol (simple calculation by NIST; no Washburn corrections)

Phase change data

Data compiled by: Thermodynamics Research Center, NIST Boulder Laboratories, Chris Muzny director

Quantity Value Units Method Reference Comment
Tboil493.15KN/ALamberti and Wise, 1953Uncertainty assigned by TRC = 1. K
Tboil478.KN/AKlages, 1904Uncertainty assigned by TRC = 6. K

In addition to the Thermodynamics Research Center (TRC) data available from this site, much more physical and chemical property data is available from the following TRC products:

References

Auwsers, Roth, et al., 1910
Auwsers, K.; Roth, W.A.; Eisenlohr, F., III. Verbrennungswarmen von Terpenen und Styrolen, Justus Liebigs Ann. Chem., 1910, 267-290. [all data]

Lamberti and Wise, 1953
Lamberti, J.M.; Wise, P.H., Synthesis and Physical Properties of Some C11 ANd C12 Phenylalkane and Cyclohexylalkane Hydrocarbons, J. Am. Chem. Soc., 1953, 75, 4787. [all data]

Klages, 1904
Klages, A., Ber. Dtsch. Chem. Ges., 1904, 37, 1721. [all data]