Caffeic acid

Phase change data

Data compiled by: William E. Acree, Jr., James S. Chickos

Enthalpy of sublimation

ΔsubH (kJ/mol) Temperature (K) Reference Comment
170.2 ± 4.6411.Chen, Oja, et al., 2006Based on data from 409. - 424. K.

Normal alkane RI, non-polar column, custom temperature program

View large format table.

Column type Active phase I Reference Comment
CapillaryDB-11478.Variyar, Ahmad, et al., 200330. m/0.25 mm/0.25 μm, He; Program: 60C => 4C/min => 200C (5min) => 10C/min => 280C (20min)

References

Chen, Oja, et al., 2006
Chen, Xu; Oja, Vahur; Chan, W. Geoffrey; Hajaligol, Mohammad R., Vapor Pressure Characterization of Several Phenolics and Polyhydric Compounds by Knudsen Effusion Method, J. Chem. Eng. Data, 2006, 51, 2, 386-391, https://doi.org/10.1021/je050293h . [all data]

Variyar, Ahmad, et al., 2003
Variyar, P.S.; Ahmad, R.; Bhat, R.; Niyas, Z.; Sharma, A., Flavoring components of raw monsooned Arabica coffee and their changes during radiation processing, J. Agric. Food Chem., 2003, 51, 27, 7945-7950, https://doi.org/10.1021/jf030408q . [all data]