Cyclohexanecarboxylic acid, 4-amino-, lactam

Gas phase ion energetics data

Data compiled by: Sharon G. Lias, John E. Bartmess, Joel F. Liebman, John L. Holmes, Rhoda D. Levin, and W. Gary Mallard

Ionization energy determinations

IE (eV) Method Reference Comment
9.12PETreschanke and Rademacher, 1985Vertical value

References

Treschanke and Rademacher, 1985
Treschanke, L.; Rademacher, P., Electronic structure and conformational properties of the amide linkage, J. Mol. Struct., 1985, 122, 47. [all data]