η5-Cyclopentadienyl ethynyl iron dicarbonyl

Gas phase ion energetics data

Data compiled by: Sharon G. Lias and Joel F. Liebman

Ionization energy determinations

IE (eV) Method Reference Comment
7.79 ± 0.02PELichtenberger, Renshaw, et al., 1993Vertical value

References

Lichtenberger, Renshaw, et al., 1993
Lichtenberger, D.L.; Renshaw, S.K.; Bullock, R.M., Metal-acetylide bonding in (η<5>-C5H5)Fe(CO)2C≡CR compounds. Measures of metal-dπ-acetylide-π interactions from photoelectron spectroscopy, J. Am. Chem. Soc., 1993, 115, 3276. [all data]