1,2-Diazabicyclo[2.2.2]octane

Gas phase ion energetics data

Data compiled by: Sharon G. Lias, Rhoda D. Levin, and Sherif A. Kafafi

Ionization energy determinations

IE (eV) Method Reference Comment
8.52PENelsen and Buschek, 1974Vertical value

References

Nelsen and Buschek, 1974
Nelsen, S.F.; Buschek, J.M., Photoelectron spectra of hydrazines. V. Pyrazolidine and hexahydropyridazine derivatives, J. Am. Chem. Soc., 1974, 96, 6987. [all data]