Difluorocarboncyamidic amide

Phase change data

Data compiled by: William E. Acree, Jr., James S. Chickos

Enthalpy of vaporization

ΔvapH (kcal/mol) Temperature (K) Reference
7.10383.Wright and Shreeve, 1973

References

Wright and Shreeve, 1973
Wright, Kenneth J.; Shreeve, Jean'ne M., Chemistry of difluoraminocarbonyl chloride. New route to perfluorourea, Inorg. Chem., 1973, 12, 1, 77-80, https://doi.org/10.1021/ic50119a020 . [all data]