Heptafluoropropionamide

Phase change data

Data compiled by: William E. Acree, Jr., James S. Chickos

Enthalpy of vaporization

ΔvapH (kJ/mol) Temperature (K) Method Reference
27.2279.HGShreeve and De Marco, 1971

References

Shreeve and De Marco, 1971
Shreeve, Jean'ne M.; De Marco, Ronald A., Reaction of difluoramine-potassium fluoride adduct with perfluoroacyl fluorides, Inorg. Chem., 1971, 10, 5, 911-913, https://doi.org/10.1021/ic50099a009 . [all data]