2(1H)-Pyridone, 6-methyl-

Phase change data

Data compiled as indicated in comments:
ALS - Hussein Y. Afeefy, Joel F. Liebman, and Stephen E. Stein
AC - William E. Acree, Jr., James S. Chickos

Quantity Value Units Method Reference Comment
Δsub22.0 ± 0.31kcal/molCSuradi, El Saiad, et al., 1982ALS
Δsub22.0 ± 0.31kcal/molCSuradi, El Saiad, et al., 1982See also Pedley, Naylor, et al., 1986.; AC

References

Suradi, El Saiad, et al., 1982
Suradi, S.; El Saiad, N.; Pilcher, G.; Skinner, H.A., Enthalpies of combustion of the three hydroxy-pyridines and the four hydroxy-2-methylpyridines, J. Chem. Thermodyn., 1982, 14, 45-50. [all data]

Pedley, Naylor, et al., 1986
Pedley, J.B.; Naylor, R.D.; Kirby, S.P., Thermochemical Data of Organic Compounds, 1986, https://doi.org/10.1007/978-94-009-4099-4 . [all data]