potassium propionate

Condensed phase thermochemistry data

Data compiled by: Eugene S. Domalski and Elizabeth D. Hearing

Quantity Value Units Method Reference Comment
solid,1 bar34.03cal/mol*KN/AFranzosini and Westrum, 1984

Constant pressure heat capacity of solid

Cp,solid (cal/mol*K) Temperature (K) Reference Comment
30.95298.15Franzosini and Westrum, 1984T = 10 to 340 K.

References

Franzosini and Westrum, 1984
Franzosini, P.; Westrum, E.F., Jr., Thermophysics of metal alkanoates. III. Heat capacities and thermodynamic properties of lithium and potassium propanoates, J. Chem. Thermodynam., 1984, 16, 81-90. [all data]